Форум программистов, компьютерный форум CyberForum.ru

Eclipse ndk странные ошибки - Android

Восстановить пароль Регистрация
 
contedevel
 Аватар для contedevel
57 / 55 / 8
Регистрация: 07.10.2012
Сообщений: 589
06.04.2014, 10:46     Eclipse ndk странные ошибки #1
Здравствуйте!

Вот мой код:
com_contedevel_tests_SpeedTest.h
C++
1
2
3
4
5
6
7
8
9
10
11
12
13
14
15
16
17
18
19
20
21
/* DO NOT EDIT THIS FILE - it is machine generated */
#include <jni.h>
/* Header for class com_contedevel_tests_SpeedTest */
 
#ifndef _Included_com_contedevel_tests_SpeedTest
#define _Included_com_contedevel_tests_SpeedTest
#ifdef __cplusplus
extern "C" {
#endif
/*
 * Class:     com_contedevel_tests_SpeedTest
 * Method:    getResult
 * Signature: ([F[FII)F
 */
JNIEXPORT jfloat JNICALL Java_com_contedevel_tests_SpeedTest_getResult
  (JNIEnv *, jobject, jfloatArray, jfloatArray, jint, jint);
 
#ifdef __cplusplus
}
#endif
#endif
tests.cpp
C++
1
2
3
4
5
6
7
8
#include "com_contedevel_tests_SpeedTest.h"
 
JNIEXPORT jfloat JNICALL Java_com_contedevel_tests_SpeedTest_getResult
  (JNIEnv * env, jobject obj, jfloatArray m1, jfloatArray m2, jint s1, jint s2) {
    float res = 0;
    
    return res;
}
А вот вывод при сборке:
Кликните здесь для просмотра всего текста
10:37:55 **** Build of configuration Default for project tests ****
/home/contedevel/android-ndk/ndk-build all
Android NDK: WARNING: APP_PLATFORM android-19 is larger than android:minSdkVersion 8 in ./AndroidManifest.xml
[armeabi-v7a] Compile++ thumb: tests <= tests.cpp
jni/tests.cpp: In function 'jfloat Java_com_contedevel_tests_SpeedTest_getResult(JNIEnv*, jobject, jfloatArray, jfloatArray, jint, jint)':
jni/tests.cpp:5:56: error: variable-sized object 'm' may not be initialized
jni/tests.cpp:7:20: error: no match for 'operator*' in '*(m1 + ((unsigned int)i)) * *(m2 + ((unsigned int)i))'
jni/tests.cpp:10:9: error: cannot convert '_jfloatArray**' to 'jfloat {aka float}' in return
make: *** [obj/local/armeabi-v7a/objs/tests/tests.o] Error 1

10:37:55 Build Finished (took 169ms)


Я не понимаю, в чем ошибка... Кто-нибудь может объяснить?
Similar
Эксперт
41792 / 34177 / 6122
Регистрация: 12.04.2006
Сообщений: 57,940
06.04.2014, 10:46     Eclipse ndk странные ошибки
Посмотрите здесь:

Странные ошибки при компиляции проекта Android
Android Eclipse + Android NDK + Cygwin
Android Сборка приложения NDK sample в Eclipse
Android Android NDK
Android Android NDK
Android SDK or NDK
Подключить NDK Android
NDK C vs C++ и примеры Android
Android Ошибки при создании проекта в Eclipse
Eclipse ошибки в appcompat v7 Android
AS и Ndk Android
Android Ошибки android-support-v7 при создании нового проекта в Eclipse

Искать еще темы с ответами

Или воспользуйтесь поиском по форуму:
После регистрации реклама в сообщениях будет скрыта и будут доступны все возможности форума.
EVP
317 / 239 / 42
Регистрация: 14.12.2010
Сообщений: 460
06.04.2014, 14:26     Eclipse ndk странные ошибки #2
Цитата Сообщение от contedevel Посмотреть сообщение
Я не понимаю, в чем ошибка... Кто-нибудь может объяснить?
Завёлся файла дубликат в проекте вашем.
Указывает компилятор на паразита этого.
contedevel
 Аватар для contedevel
57 / 55 / 8
Регистрация: 07.10.2012
Сообщений: 589
06.04.2014, 15:09  [ТС]     Eclipse ndk странные ошибки #3
Попробую поискать
Yandex
Объявления
06.04.2014, 15:09     Eclipse ndk странные ошибки
Ответ Создать тему
Опции темы

Текущее время: 17:40. Часовой пояс GMT +3.
КиберФорум - форум программистов, компьютерный форум, программирование
Powered by vBulletin® Version 3.8.9
Copyright ©2000 - 2017, vBulletin Solutions, Inc.
Рейтинг@Mail.ru