Форум программистов, компьютерный форум, киберфорум
Наши страницы
Программирование Android
Войти
Регистрация
Восстановить пароль
 
Рейтинг 4.93/15: Рейтинг темы: голосов - 15, средняя оценка - 4.93
CherniyVlasteli
0 / 0 / 0
Регистрация: 09.12.2013
Сообщений: 18
1

Как исправить ошибку в Android Studio?

11.02.2015, 00:50. Просмотров 2872. Ответов 2
Метки нет (Все метки)

Что с андроид студией?
Кто-нибудь знает как решить данную проблему?И почему она возникает?
В проект не чего особенного не добавлял.И пробовал пустые проекты, но исход всегда один.
Многие начинающие программисты будут счастливы услышать граммотный ответ, который избавит их от проблем


Information:Gradle tasks [:app:assembleDebug]
Information:Total time: 8.05 secs
Error:Execution failed for task ':app:dexDebug'.
> com.android.ide.common.internal.LoggedErrorException: Failed to run command:
C:\Program Files\Android\android-sdk\build-tools\21.1.2\dx.bat --dex --no-optimize --output C:\Users\Виталя\AndroidStudioProjects\myPlay\app\build\intermediates\dex\debug --input-list=C:\Users\Виталя\AndroidStudioProjects\myPlay\app\build\intermediates\tmp\dex\debug\inputList.txt
Error Code:
1
Output:
UNEXPECTED TOP-LEVEL EXCEPTION:
java.lang.RuntimeException: C:\Users\Виталя\AndroidStudioProjects\myPlay\app\build\intermediates\classes\debug: file not found
at com.android.dex.util.FileUtils.readFile(FileUtils.java:51)
at com.android.dx.cf.direct.ClassPathOpener.processOne(ClassPathOpener.java:169)
at com.android.dx.cf.direct.ClassPathOpener.process(ClassPathOpener.java:144)
at com.android.dx.command.dexer.Main.processOne(Main.java:632)
at com.android.dx.command.dexer.Main.processAllFiles(Main.java:510)
at com.android.dx.command.dexer.Main.runMonoDex(Main.java:280)
at com.android.dx.command.dexer.Main.run(Main.java:246)
at com.android.dx.command.dexer.Main.main(Main.java:215)
at com.android.dx.command.Main.main(Main.java:106)
UNEXPECTED TOP-LEVEL EXCEPTION:
java.io.FileNotFoundException: C:\Users\Виталя\AndroidStudioProjects\myPlay\app\build\intermediates\pre-dexed\debug\support-annotations-21.0.3-595d0275e03ed44e5fc865b538a26cda00f78f33.jar (Системе не удается найти указанный путь)
at java.util.zip.ZipFile.open(Native Method)
at java.util.zip.ZipFile.<init>(Unknown Source)
at java.util.zip.ZipFile.<init>(Unknown Source)
at java.util.zip.ZipFile.<init>(Unknown Source)
at com.android.dx.cf.direct.ClassPathOpener.processArchive(ClassPathOpener.java:244)
at com.android.dx.cf.direct.ClassPathOpener.processOne(ClassPathOpener.java:166)
at com.android.dx.cf.direct.ClassPathOpener.process(ClassPathOpener.java:144)
at com.android.dx.command.dexer.Main.processOne(Main.java:632)
at com.android.dx.command.dexer.Main.processAllFiles(Main.java:510)
at com.android.dx.command.dexer.Main.runMonoDex(Main.java:280)
at com.android.dx.command.dexer.Main.run(Main.java:246)
at com.android.dx.command.dexer.Main.main(Main.java:215)
at com.android.dx.command.Main.main(Main.java:106)
UNEXPECTED TOP-LEVEL EXCEPTION:
java.io.FileNotFoundException: C:\Users\Виталя\AndroidStudioProjects\myPlay\app\build\intermediates\pre-dexed\debug\internal_impl-21.0.3-bec377ef451f7c9d75f35b83c9464d72ab43c04a.jar (Системе не удается найти указанный путь)
at java.util.zip.ZipFile.open(Native Method)
at java.util.zip.ZipFile.<init>(Unknown Source)
at java.util.zip.ZipFile.<init>(Unknown Source)
at java.util.zip.ZipFile.<init>(Unknown Source)
at com.android.dx.cf.direct.ClassPathOpener.processArchive(ClassPathOpener.java:244)
at com.android.dx.cf.direct.ClassPathOpener.processOne(ClassPathOpener.java:166)
at com.android.dx.cf.direct.ClassPathOpener.process(ClassPathOpener.java:144)
at com.android.dx.command.dexer.Main.processOne(Main.java:632)
at com.android.dx.command.dexer.Main.processAllFiles(Main.java:510)
at com.android.dx.command.dexer.Main.runMonoDex(Main.java:280)
at com.android.dx.command.dexer.Main.run(Main.java:246)
at com.android.dx.command.dexer.Main.main(Main.java:215)
at com.android.dx.command.Main.main(Main.java:106)
UNEXPECTED TOP-LEVEL EXCEPTION:
java.io.FileNotFoundException: C:\Users\Виталя\AndroidStudioProjects\myPlay\app\build\intermediates\pre-dexed\debug\classes-172b2ca522c9657b59811f8c978a5f860e31cc4f.jar (Системе не удается найти указанный путь)
at java.util.zip.ZipFile.open(Native Method)
at java.util.zip.ZipFile.<init>(Unknown Source)
at java.util.zip.ZipFile.<init>(Unknown Source)
at java.util.zip.ZipFile.<init>(Unknown Source)
at com.android.dx.cf.direct.ClassPathOpener.processArchive(ClassPathOpener.java:244)
at com.android.dx.cf.direct.ClassPathOpener.processOne(ClassPathOpener.java:166)
at com.android.dx.cf.direct.ClassPathOpener.process(ClassPathOpener.java:144)
at com.android.dx.command.dexer.Main.processOne(Main.java:632)
at com.android.dx.command.dexer.Main.processAllFiles(Main.java:510)
at com.android.dx.command.dexer.Main.runMonoDex(Main.java:280)
at com.android.dx.command.dexer.Main.run(Main.java:246)
at com.android.dx.command.dexer.Main.main(Main.java:215)
at com.android.dx.command.Main.main(Main.java:106)
UNEXPECTED TOP-LEVEL EXCEPTION:
java.io.FileNotFoundException: C:\Users\Виталя\AndroidStudioProjects\myPlay\app\build\intermediates\pre-dexed\debug\classes-1d8423ac0ed0b5026f6abcf60d961bbd73303271.jar (Системе не удается найти указанный путь)
at java.util.zip.ZipFile.open(Native Method)
at java.util.zip.ZipFile.<init>(Unknown Source)
at java.util.zip.ZipFile.<init>(Unknown Source)
at java.util.zip.ZipFile.<init>(Unknown Source)
at com.android.dx.cf.direct.ClassPathOpener.processArchive(ClassPathOpener.java:244)
at com.android.dx.cf.direct.ClassPathOpener.processOne(ClassPathOpener.java:166)
at com.android.dx.cf.direct.ClassPathOpener.process(ClassPathOpener.java:144)
at com.android.dx.command.dexer.Main.processOne(Main.java:632)
at com.android.dx.command.dexer.Main.processAllFiles(Main.java:510)
at com.android.dx.command.dexer.Main.runMonoDex(Main.java:280)
at com.android.dx.command.dexer.Main.run(Main.java:246)
at com.android.dx.command.dexer.Main.main(Main.java:215)
at com.android.dx.command.Main.main(Main.java:106)
5 errors; aborting
:app: preBuild
:app: generateDebugSources UP-TO-DATE
UNEXPECTED TOP-LEVEL EXCEPTION:
:app: generateDebugResources UP-TO-DATE
:app: mergeDebugResources UP-TO-DATE
:app: compileDebugNdk UP-TO-DATE
:app: preReleaseBuild
Information:BUILD FAILED
:app: processDebugResources UP-TO-DATE
:app: generateDebugAssets UP-TO-DATE
:app: compileDebugAidl UP-TO-DATE
:app: prepareComAndroidSupportSupportV42103Library UP-TO-DATE
:app: preDebugBuild
:app: dexDebug
UNEXPECTED TOP-LEVEL EXCEPTION:
UNEXPECTED TOP-LEVEL EXCEPTION:
:app: generateDebugBuildConfig UP-TO-DATE
:app: compileDebugJava UP-TO-DATE
:app: processDebugManifest UP-TO-DATE
UNEXPECTED TOP-LEVEL EXCEPTION:
UNEXPECTED TOP-LEVEL EXCEPTION:
:app: prepareDebugDependencies
:app: preDexDebug UP-TO-DATE
:app: generateDebugResValues UP-TO-DATE
:app: mergeDebugAssets UP-TO-DATE
:app: compileDebugRenderscript UP-TO-DATE
5 errors; aborting
:app:checkDebugManifest
:app: prepareComAndroidSupportAppcompatV72103Library UP-TO-DATE
Information:0 warnings
Information:1 error
Information:See complete output in console
0
Надоела реклама? Зарегистрируйтесь и она исчезнет полностью.
Similar
Эксперт
41792 / 34177 / 6122
Регистрация: 12.04.2006
Сообщений: 57,940
11.02.2015, 00:50
Ответы с готовыми решениями:

Как исправить ошибку Android Studio «No server to serve request»?
Система: Xubuntu 18.04 32-bit. В логах ничего нету. Просто на этапе Make...

Не производится компиляция в Android Studio. Как исправить?
Проект пустой! Есть только начальная страница Error:Execution failed for...

Не производится компиляция в Android Studio. Как исправить?
Проект пустой! Есть только начальная страница Error:Execution failed for...

Как исправить ошибки после запуска в Android studio
Вот картинка помогите пожалуйста!...

Как исправить ошибку Failed to resolve: com.android.support.test.espresso-core:2.2.3
При запуске готового проекта в Android Studio появляются ошибки, как их можно...

2
Rube
911 / 559 / 88
Регистрация: 13.02.2014
Сообщений: 2,074
11.02.2015, 08:10 2
Виталя, ищите проблему тут C:\Users\Виталя\AndroidStudioProjects\
0
_Vertigo_
14 / 14 / 6
Регистрация: 07.09.2013
Сообщений: 159
Завершенные тесты: 1
14.02.2015, 19:26 3
CherniyVlasteli, у Вас имя пользователя прописано кириллицей, это не есть хорошо для студии.
Вместо C:\Users\Виталий\AndroidStudioProjects\ должно быть C:\Users\Vitaly\AndroidStudioProjects\
Если есть проблемы с исправлением данного недоразумения, то вот ссылка, должно помочь:
http://www.cherneenet.ru/lokalnaj_zapis.html
0
MoreAnswers
Эксперт
37091 / 29110 / 5898
Регистрация: 17.06.2006
Сообщений: 43,301
14.02.2015, 19:26

(Android studio, java) Ошибка при импорте библиотеки cannot resolve symbol android studio
Вот библиотека https://github.com/mik3y/usb-serial-for-android. Устанавливал...

Android studio, как запускать программу сразу на android смартфоне подключенному к usb?
android studio, как запускать программу сразу на android смартфоне...

Как установить Android Studio?
Всем привет! На оф. сайте взял дистрибутив и установил Android Studio....


Искать еще темы с ответами

Или воспользуйтесь поиском по форуму:
3
Ответ Создать тему
Опции темы

КиберФорум - форум программистов, компьютерный форум, программирование
Powered by vBulletin® Version 3.8.9
Copyright ©2000 - 2018, vBulletin Solutions, Inc.
Рейтинг@Mail.ru