Форум программистов, компьютерный форум CyberForum.ru

Программирование Android

Войти
Регистрация
Восстановить пароль
 
MrScrat
19 / 5 / 1
Регистрация: 28.09.2014
Сообщений: 79
#1

Ошибка сборки после подключения AdColony - Программирование Android

19.07.2016, 15:56. Просмотров 620. Ответов 8
Метки нет (Все метки)

Подключил рекламу AdColony в свое приложение, хотел затестить на своем мобильнике, но Android Studio выдал такое:
Код
Information:Gradle tasks [:app:assembleDebug]
:app:preBuild UP-TO-DATE
:app:preDebugBuild UP-TO-DATE
:app:checkDebugManifest
:app:preReleaseBuild UP-TO-DATE
:app:prepareComAndroidSupportAnimatedVectorDrawable2321Library UP-TO-DATE
:app:prepareComAndroidSupportAppcompatV72321Library UP-TO-DATE
:app:prepareComAndroidSupportDesign2321Library UP-TO-DATE
:app:prepareComAndroidSupportMediarouterV72300Library UP-TO-DATE
:app:prepareComAndroidSupportRecyclerviewV72321Library UP-TO-DATE
:app:prepareComAndroidSupportSupportV42321Library UP-TO-DATE
:app:prepareComAndroidSupportSupportVectorDrawable2321Library UP-TO-DATE
:app:prepareComGoogleAndroidGmsPlayServices921Library UP-TO-DATE
:app:prepareComGoogleAndroidGmsPlayServicesAds921Library UP-TO-DATE
:app:prepareComGoogleAndroidGmsPlayServicesAdsLite921Library UP-TO-DATE
:app:prepareComGoogleAndroidGmsPlayServicesAnalytics921Library UP-TO-DATE
:app:prepareComGoogleAndroidGmsPlayServicesAnalyticsImpl921Library UP-TO-DATE
:app:prepareComGoogleAndroidGmsPlayServicesAppindexing921Library UP-TO-DATE
:app:prepareComGoogleAndroidGmsPlayServicesAppinvite921Library UP-TO-DATE
:app:prepareComGoogleAndroidGmsPlayServicesAuth921Library UP-TO-DATE
:app:prepareComGoogleAndroidGmsPlayServicesAuthBase921Library UP-TO-DATE
:app:prepareComGoogleAndroidGmsPlayServicesBase921Library UP-TO-DATE
:app:prepareComGoogleAndroidGmsPlayServicesBasement921Library UP-TO-DATE
:app:prepareComGoogleAndroidGmsPlayServicesCast921Library UP-TO-DATE
:app:prepareComGoogleAndroidGmsPlayServicesCastFramework921Library UP-TO-DATE
:app:prepareComGoogleAndroidGmsPlayServicesClearcut921Library UP-TO-DATE
:app:prepareComGoogleAndroidGmsPlayServicesContextmanager921Library UP-TO-DATE
:app:prepareComGoogleAndroidGmsPlayServicesDrive921Library UP-TO-DATE
:app:prepareComGoogleAndroidGmsPlayServicesFitness921Library UP-TO-DATE
:app:prepareComGoogleAndroidGmsPlayServicesGames921Library UP-TO-DATE
:app:prepareComGoogleAndroidGmsPlayServicesGass921Library UP-TO-DATE
:app:prepareComGoogleAndroidGmsPlayServicesGcm921Library UP-TO-DATE
:app:prepareComGoogleAndroidGmsPlayServicesIdentity921Library UP-TO-DATE
:app:prepareComGoogleAndroidGmsPlayServicesIid921Library UP-TO-DATE
:app:prepareComGoogleAndroidGmsPlayServicesLocation921Library UP-TO-DATE
:app:prepareComGoogleAndroidGmsPlayServicesMaps921Library UP-TO-DATE
:app:prepareComGoogleAndroidGmsPlayServicesNearby921Library UP-TO-DATE
:app:prepareComGoogleAndroidGmsPlayServicesPanorama921Library UP-TO-DATE
:app:prepareComGoogleAndroidGmsPlayServicesPlaces921Library UP-TO-DATE
:app:prepareComGoogleAndroidGmsPlayServicesPlus921Library UP-TO-DATE
:app:prepareComGoogleAndroidGmsPlayServicesSafetynet921Library UP-TO-DATE
:app:prepareComGoogleAndroidGmsPlayServicesTagmanager921Library UP-TO-DATE
:app:prepareComGoogleAndroidGmsPlayServicesTagmanagerApi921Library UP-TO-DATE
:app:prepareComGoogleAndroidGmsPlayServicesTasks921Library UP-TO-DATE
:app:prepareComGoogleAndroidGmsPlayServicesVision921Library UP-TO-DATE
:app:prepareComGoogleAndroidGmsPlayServicesWallet921Library UP-TO-DATE
:app:prepareComGoogleAndroidGmsPlayServicesWearable921Library UP-TO-DATE
:app:prepareComGoogleFirebaseFirebaseAnalytics921Library UP-TO-DATE
:app:prepareComGoogleFirebaseFirebaseAnalyticsImpl921Library UP-TO-DATE
:app:prepareComGoogleFirebaseFirebaseAuth921Library UP-TO-DATE
:app:prepareComGoogleFirebaseFirebaseAuthCommon921Library UP-TO-DATE
:app:prepareComGoogleFirebaseFirebaseAuthModule921Library UP-TO-DATE
:app:prepareComGoogleFirebaseFirebaseCommon921Library UP-TO-DATE
:app:prepareComGoogleFirebaseFirebaseConfig921Library UP-TO-DATE
:app:prepareComGoogleFirebaseFirebaseCrash921Library UP-TO-DATE
:app:prepareComGoogleFirebaseFirebaseDatabase921Library UP-TO-DATE
:app:prepareComGoogleFirebaseFirebaseDatabaseConnection921Library UP-TO-DATE
:app:prepareComGoogleFirebaseFirebaseIid921Library UP-TO-DATE
:app:prepareComGoogleFirebaseFirebaseMessaging921Library UP-TO-DATE
:app:prepareComGoogleFirebaseFirebaseStorage921Library UP-TO-DATE
:app:prepareComGoogleFirebaseFirebaseStorageCommon921Library UP-TO-DATE
:app:prepareComMikepenzIconicsCore176Library UP-TO-DATE
:app:prepareComMikepenzMaterialdrawer433Library UP-TO-DATE
:app:prepareComMikepenzMaterialize025Library UP-TO-DATE
:app:prepareDebugDependencies
:app:compileDebugAidl UP-TO-DATE
:app:compileDebugRenderscript UP-TO-DATE
:app:generateDebugBuildConfig UP-TO-DATE
:app:generateDebugResValues UP-TO-DATE
:app:generateDebugResources UP-TO-DATE
:app:mergeDebugResources UP-TO-DATE
:app:processDebugManifest
:app:processDebugResources
:app:generateDebugSources
:app:incrementalDebugJavaCompilationSafeguard UP-TO-DATE
:app:compileDebugJavaWithJavac
Full recompilation is required because 'MainActivity.java' was changed. Analysis took 0.068 secs.
Note: Some input files use or override a deprecated API.
Note: Recompile with -Xlint:deprecation for details.
:app:compileDebugNdk UP-TO-DATE
:app:compileDebugSources
:app:mergeDebugShaders UP-TO-DATE
:app:compileDebugShaders UP-TO-DATE
:app:generateDebugAssets UP-TO-DATE
:app:mergeDebugAssets UP-TO-DATE
:app:transformClassesWithDexForDebug
Running dex in-process requires build tools 23.0.2.
For faster builds update this project to use the latest build tools.
Error:The number of method references in a .dex file cannot exceed 64K.
Learn how to resolve this issue at https://developer.android.com/tools/building/multidex.html
:app:transformClassesWithDexForDebug FAILED
Error:Execution failed for task ':app:transformClassesWithDexForDebug'.
> com.android.build.api.transform.TransformException: com.android.ide.common.process.ProcessException: java.util.concurrent.ExecutionException: java.lang.UnsupportedOperationException
Information:BUILD FAILED
Information:Total time: 2 mins 2.66 secs
Information:2 errors
Information:0 warnings
Information:See complete output in console
В чем может быть проблема и как ее решить? Заранее огромное спасибо.
Лучшие ответы (1)
Similar
Эксперт
41792 / 34177 / 6122
Регистрация: 12.04.2006
Сообщений: 57,940
19.07.2016, 15:56
Здравствуйте! Я подобрал для вас темы с ответами на вопрос Ошибка сборки после подключения AdColony (Программирование Android):

Google Maps не отображается карта после сборки apk - Программирование Android
Добрый день. Помогите пожалуйста советом. Написал приложение с использованием карт Google собираю/тестирую сразу на телефоне, создаю apk...

NDK ошибка сборки проекта - Программирование Android
Здравствуйте! Пытаюсь настроить сборку C++ библиотеки в Android Studio. Делал по примерам, в итоге получил такой build.gradle: apply...

После подключения ListViewAnimations не могу собрать проект - Программирование Android
Добрый день! Решил попробовать применить чужую библиотеку ListViewAnimations https://github.com/nhaarman/ListViewAnimations Дока...

Ошибка подключения через ssl - Программирование Android
Surespot клиент работает без ssl, но не работает с ним. Логи клиента в аттаче. Логи сервера пусты, видимо клиент даже не может подключится.

При создании класса в проекте, после сборки появляется ошибка Ошибка HTTP 403.14 - Forbidden. - C# ASP.NET
Сайт только начинаю делать. БД подключена, данные выводятся. При создании класса в проекте, после сборки появляется ошибка Ошибка HTTP...

Ошибка CLR20r3 после сборки проекта - .NET
После создании setup файла и после установки приложения на другом пк при запуске возникает ошибка при запуске. Фрейморк устанавливается при...

Надоела реклама? Зарегистрируйтесь и она исчезнет полностью.
Pablito
2473 / 1918 / 595
Регистрация: 12.05.2014
Сообщений: 6,746
Завершенные тесты: 1
19.07.2016, 16:38 #2
пройти по ссылке, которая в логе указана не?
https://developer.android.com/studio.../multidex.html

там всего-то три строчки прописать - одна в манифесте, и еще две - в градле
MrScrat
19 / 5 / 1
Регистрация: 28.09.2014
Сообщений: 79
19.07.2016, 16:50  [ТС] #3
Паблито, я это сразу же и сделал, после этого мне еще больше ошибок вылезло.

Добавлено через 6 минут
Код
Information:Gradle tasks [:app:assembleDebug]
:app:preBuild UP-TO-DATE
:app:preDebugBuild UP-TO-DATE
:app:checkDebugManifest
:app:preReleaseBuild UP-TO-DATE
:app:prepareComAndroidSupportAnimatedVectorDrawable2321Library UP-TO-DATE
:app:prepareComAndroidSupportAppcompatV72321Library UP-TO-DATE
:app:prepareComAndroidSupportDesign2321Library UP-TO-DATE
:app:prepareComAndroidSupportMediarouterV72300Library UP-TO-DATE
:app:preDebugAndroidTestBuild UP-TO-DATE
:app:prepareComAndroidSupportMultidex101Library UP-TO-DATE
:app:prepareComAndroidSupportRecyclerviewV72321Library UP-TO-DATE
:app:prepareComAndroidSupportSupportV42321Library UP-TO-DATE
:app:prepareComAndroidSupportSupportVectorDrawable2321Library UP-TO-DATE
:app:prepareComGoogleAndroidGmsPlayServices921Library UP-TO-DATE
:app:prepareComGoogleAndroidGmsPlayServicesAds921Library UP-TO-DATE
:app:prepareComGoogleAndroidGmsPlayServicesAdsLite921Library UP-TO-DATE
:app:prepareComGoogleAndroidGmsPlayServicesAnalytics921Library UP-TO-DATE
:app:prepareComGoogleAndroidGmsPlayServicesAnalyticsImpl921Library UP-TO-DATE
:app:prepareComGoogleAndroidGmsPlayServicesAppindexing921Library UP-TO-DATE
:app:prepareComGoogleAndroidGmsPlayServicesAppinvite921Library UP-TO-DATE
:app:prepareComGoogleAndroidGmsPlayServicesAuth921Library UP-TO-DATE
:app:prepareComGoogleAndroidGmsPlayServicesAuthBase921Library UP-TO-DATE
:app:prepareComGoogleAndroidGmsPlayServicesBase921Library UP-TO-DATE
:app:prepareComGoogleAndroidGmsPlayServicesBasement921Library UP-TO-DATE
:app:prepareComGoogleAndroidGmsPlayServicesCast921Library UP-TO-DATE
:app:prepareComGoogleAndroidGmsPlayServicesCastFramework921Library UP-TO-DATE
:app:prepareComGoogleAndroidGmsPlayServicesClearcut921Library UP-TO-DATE
:app:prepareComGoogleAndroidGmsPlayServicesContextmanager921Library UP-TO-DATE
:app:prepareComGoogleAndroidGmsPlayServicesDrive921Library UP-TO-DATE
:app:prepareComGoogleAndroidGmsPlayServicesFitness921Library UP-TO-DATE
:app:prepareComGoogleAndroidGmsPlayServicesGames921Library UP-TO-DATE
:app:prepareComGoogleAndroidGmsPlayServicesGass921Library UP-TO-DATE
:app:prepareComGoogleAndroidGmsPlayServicesGcm921Library UP-TO-DATE
:app:prepareComGoogleAndroidGmsPlayServicesIdentity921Library UP-TO-DATE
:app:prepareComGoogleAndroidGmsPlayServicesIid921Library UP-TO-DATE
:app:prepareComGoogleAndroidGmsPlayServicesLocation921Library UP-TO-DATE
:app:prepareComGoogleAndroidGmsPlayServicesMaps921Library UP-TO-DATE
:app:prepareComGoogleAndroidGmsPlayServicesNearby921Library UP-TO-DATE
:app:prepareComGoogleAndroidGmsPlayServicesPanorama921Library UP-TO-DATE
:app:prepareComGoogleAndroidGmsPlayServicesPlaces921Library UP-TO-DATE
:app:prepareComGoogleAndroidGmsPlayServicesPlus921Library UP-TO-DATE
:app:prepareComGoogleAndroidGmsPlayServicesSafetynet921Library UP-TO-DATE
:app:prepareComGoogleAndroidGmsPlayServicesTagmanager921Library UP-TO-DATE
:app:prepareComGoogleAndroidGmsPlayServicesTagmanagerApi921Library UP-TO-DATE
:app:prepareComGoogleAndroidGmsPlayServicesTasks921Library UP-TO-DATE
:app:prepareComGoogleAndroidGmsPlayServicesVision921Library UP-TO-DATE
:app:prepareComGoogleAndroidGmsPlayServicesWallet921Library UP-TO-DATE
:app:prepareComGoogleAndroidGmsPlayServicesWearable921Library UP-TO-DATE
:app:prepareComGoogleFirebaseFirebaseAnalytics921Library UP-TO-DATE
:app:prepareComGoogleFirebaseFirebaseAnalyticsImpl921Library UP-TO-DATE
:app:prepareComGoogleFirebaseFirebaseAuth921Library UP-TO-DATE
:app:prepareComGoogleFirebaseFirebaseAuthCommon921Library UP-TO-DATE
:app:prepareComGoogleFirebaseFirebaseAuthModule921Library UP-TO-DATE
:app:prepareComGoogleFirebaseFirebaseCommon921Library UP-TO-DATE
:app:prepareComGoogleFirebaseFirebaseConfig921Library UP-TO-DATE
:app:prepareComGoogleFirebaseFirebaseCrash921Library UP-TO-DATE
:app:prepareComGoogleFirebaseFirebaseDatabase921Library UP-TO-DATE
:app:prepareComGoogleFirebaseFirebaseDatabaseConnection921Library UP-TO-DATE
:app:prepareComGoogleFirebaseFirebaseIid921Library UP-TO-DATE
:app:prepareComGoogleFirebaseFirebaseMessaging921Library UP-TO-DATE
:app:prepareComGoogleFirebaseFirebaseStorage921Library UP-TO-DATE
:app:prepareComGoogleFirebaseFirebaseStorageCommon921Library UP-TO-DATE
:app:prepareComMikepenzIconicsCore176Library UP-TO-DATE
:app:prepareComMikepenzMaterialdrawer433Library UP-TO-DATE
:app:prepareComMikepenzMaterialize025Library UP-TO-DATE
:app:prepareDebugDependencies
:app:compileDebugAidl UP-TO-DATE
:app:compileDebugRenderscript UP-TO-DATE
:app:generateDebugBuildConfig UP-TO-DATE
:app:generateDebugResValues UP-TO-DATE
:app:generateDebugResources UP-TO-DATE
:app:mergeDebugResources UP-TO-DATE
:app:processDebugManifest
:app:processDebugResources
:app:generateDebugSources
:app:incrementalDebugJavaCompilationSafeguard UP-TO-DATE
:app:compileDebugJavaWithJavac
None of the classes needs to be compiled! Analysis took 0.087 secs. 
:app:compileDebugNdk UP-TO-DATE
:app:compileDebugSources
:app:mergeDebugShaders UP-TO-DATE
:app:compileDebugShaders UP-TO-DATE
:app:generateDebugAssets UP-TO-DATE
:app:mergeDebugAssets UP-TO-DATE
:app:transformClassesWithJarMergingForDebug
:app:collectDebugMultiDexComponents
:app:transformClassesWithMultidexlistForDebug
:app:transformClassesWithDexForDebug
Running dex in-process requires build tools 23.0.2.
For faster builds update this project to use the latest build tools.
Error:UNEXPECTED TOP-LEVEL ERROR:
Error:java.lang.OutOfMemoryError: GC overhead limit exceeded
Error:	at com.android.dx.cf.direct.AnnotationParser.parseAnnotation(AnnotationParser.java:248)
Error:	at com.android.dx.cf.direct.AnnotationParser.parseAnnotations(AnnotationParser.java:223)
Error:	at com.android.dx.cf.direct.AnnotationParser.parseAnnotationsList(AnnotationParser.java:188)
Error:	at com.android.dx.cf.direct.AnnotationParser.parseParameterAttribute(AnnotationParser.java:127)
Error:	at com.android.dx.cf.direct.StdAttributeFactory.runtimeInvisibleParameterAnnotations(StdAttributeFactory.java:649)
Error:	at com.android.dx.cf.direct.StdAttributeFactory.parse0(StdAttributeFactory.java:157)
Error:	at com.android.dx.cf.direct.AttributeFactory.parse(AttributeFactory.java:96)
Error:	at com.android.dx.cf.direct.AttributeListParser.parse(AttributeListParser.java:141)
Error:	at com.android.dx.cf.direct.AttributeListParser.parseIfNecessary(AttributeListParser.java:115)
Error:	at com.android.dx.cf.direct.AttributeListParser.getEndOffset(AttributeListParser.java:96)
Error:	at com.android.dx.cf.direct.MemberListParser.parse(MemberListParser.java:213)
Error:	at com.android.dx.cf.direct.MemberListParser.parseIfNecessary(MemberListParser.java:108)
Error:	at com.android.dx.cf.direct.MethodListParser.getList(MethodListParser.java:54)
Error:	at com.android.dx.cf.direct.DirectClassFile.parse0(DirectClassFile.java:542)
Error:	at com.android.dx.cf.direct.DirectClassFile.parse(DirectClassFile.java:406)
Error:	at com.android.dx.cf.direct.DirectClassFile.parseToInterfacesIfNecessary(DirectClassFile.java:388)
Error:	at com.android.dx.cf.direct.DirectClassFile.getMagic(DirectClassFile.java:251)
Error:	at com.android.dx.command.dexer.Main.processClass(Main.java:704)
Error:	at com.android.dx.command.dexer.Main.processFileBytes(Main.java:673)
Error:	at com.android.dx.command.dexer.Main.access$300(Main.java:83)
Error:	at com.android.dx.command.dexer.Main$1.processFileBytes(Main.java:602)
Error:	at com.android.dx.cf.direct.ClassPathOpener.processArchive(ClassPathOpener.java:284)
Error:	at com.android.dx.cf.direct.ClassPathOpener.processOne(ClassPathOpener.java:166)
Error:	at com.android.dx.cf.direct.ClassPathOpener.process(ClassPathOpener.java:144)
Error:	at com.android.dx.command.dexer.Main.processOne(Main.java:632)
Error:	at com.android.dx.command.dexer.Main.processAllFiles(Main.java:505)
Error:	at com.android.dx.command.dexer.Main.runMultiDex(Main.java:334)
Error:	at com.android.dx.command.dexer.Main.run(Main.java:244)
Error:	at com.android.dx.command.dexer.Main.main(Main.java:215)
Error:	at com.android.dx.command.Main.main(Main.java:106)
:app:transformClassesWithDexForDebug FAILED
Error:Execution failed for task ':app:transformClassesWithDexForDebug'.
> com.android.build.api.transform.TransformException: com.android.ide.common.process.ProcessException: java.util.concurrent.ExecutionException: java.lang.UnsupportedOperationException
Information:BUILD FAILED
Information:Total time: 1 mins 36.478 secs
Information:33 errors
Information:0 warnings
Information:See complete output in console
Pablito
2473 / 1918 / 595
Регистрация: 12.05.2014
Сообщений: 6,746
Завершенные тесты: 1
19.07.2016, 16:52 #4
а что в градле?
MrScrat
19 / 5 / 1
Регистрация: 28.09.2014
Сообщений: 79
19.07.2016, 16:57  [ТС] #5
Паблито,
Java
1
2
3
4
5
6
7
8
9
10
11
12
13
14
15
16
17
18
19
20
21
22
23
24
25
26
27
28
29
30
31
32
33
34
35
36
37
38
39
40
apply plugin: 'com.android.application'
 
android {
    compileSdkVersion 23
    buildToolsVersion "21.1.2"
 
    defaultConfig {
        applicationId ""
        minSdkVersion 14
        targetSdkVersion 23
        versionCode 26
        versionName "3.0"
        multiDexEnabled true
    }
    buildTypes {
        release {
            minifyEnabled false
            proguardFiles getDefaultProguardFile('proguard-android.txt'), 'proguard-rules.pro'
        }
    }
    lintOptions {
        abortOnError false
        checkReleaseBuilds false
    }
}
 
dependencies {
    compile fileTree(include: ['*.jar'], dir: 'libs')
    compile('com.mikepenz:materialdrawer:4.3.3@aar') {
        transitive = true
    }
    compile files('libs/jsoup-1.8.3.jar')
    compile 'com.google.android.gms:play-services:9.2.1'
    compile 'com.android.support:appcompat-v7:23.2.1'
    compile 'com.android.support:support-v4:23.2.1'
    compile 'com.android.support:design:23.2.1'
    compile 'com.squareup.okhttp3:okhttp:3.2.0'
    compile files('libs/adcolony.jar')
    compile 'com.android.support:multidex:1.0.0'
}
Может ли быть проблема в том, что я сначала добавил 2 строки в proguard-rules.pro, а потом их удалил?
vxg
Модератор
3157 / 1959 / 218
Регистрация: 13.01.2012
Сообщений: 7,501
19.07.2016, 16:57 #6
MrScrat, попробовать отпилить лишние методы из адова_пака_всего_на_свете (AdColony) как вариант - через прогвард
MrScrat
19 / 5 / 1
Регистрация: 28.09.2014
Сообщений: 79
19.07.2016, 16:59  [ТС] #7
vxg, тут есть в четвертом шаге о ProGuard, просто эти 2 строк нужно добавить или что?
Pablito
2473 / 1918 / 595
Регистрация: 12.05.2014
Сообщений: 6,746
Завершенные тесты: 1
19.07.2016, 17:00 #8
Сообщение было отмечено автором темы, экспертом или модератором как ответ
Цитата Сообщение от MrScrat Посмотреть сообщение
Running dex in-process requires build tools 23.0.2.
Цитата Сообщение от MrScrat Посмотреть сообщение
buildToolsVersion "21.1.2"
для начала надо исправить тут

потом...наверняка ВСЕ play-services не нужны
поэтому вместо
XML
1
compile 'com.google.android.gms:play-services:9.2.1'
надо подключать только те модули, что необходимы
https://developers.google.com/android/guides/setup
там табличка
MrScrat
19 / 5 / 1
Регистрация: 28.09.2014
Сообщений: 79
19.07.2016, 17:07  [ТС] #9
Паблито, огромное спасибо.
MoreAnswers
Эксперт
37091 / 29110 / 5898
Регистрация: 17.06.2006
Сообщений: 43,301
19.07.2016, 17:07
Привет! Вот еще темы с ответами:

Ошибка соединения с базой данных после сборки приложения - Visual Basic .NET
Всем Добрый день! Сегодня хотел собрать свою программу... Все удачно - Зашел на проект --> Опубликовать. Получаю EXE у себя...

Ошибка при (и после) подключения - Lazarus
После того как подключил ShellApi приложение не запустилось: После удаления ShellApi, удаления папок lib и backup - не запускается ...

Bind (Soket) - ошибка при компиляции после подключения boost - C++
В общем подключил в проэкт #include <boost/regex.hpp> теперь при компиляции стало ругатся на if( bind( this->socket, ( const...

Ошибка после подключения к БД "The column prefix 'Included' does not match with a table name" - C#
есть файл connection.cs using System; using System.Collections.Generic; using System.Text; using System.Data.SqlClient; ...


Искать еще темы с ответами

Или воспользуйтесь поиском по форуму:
Yandex
Объявления
19.07.2016, 17:07
Ответ Создать тему
Опции темы

КиберФорум - форум программистов, компьютерный форум, программирование
Powered by vBulletin® Version 3.8.9
Copyright ©2000 - 2017, vBulletin Solutions, Inc.
Рейтинг@Mail.ru