Форум программистов, компьютерный форум, киберфорум
Наши страницы

Программирование Android

Войти
Регистрация
Восстановить пароль
 
 
skypevasily1299
0 / 0 / 0
Регистрация: 31.07.2016
Сообщений: 8
#1

Gradle build finished with 4 error(s). Android Studio. My First App - Программирование Android

31.07.2016, 11:14. Просмотров 909. Ответов 17

Добрый день, уважаемые форумчане!

Я - новичок в программировании под Андройд. Установил себе последнюю версию программы Android Studio с сайта developer.android.com и начал создавать своё первое приложение под Андройд так как это описано в самоучителе https://developer.android.com/training/index.html. Суть приложения сводится к созданию двух активити, в первом вбивается текст и отправляется кнопкой "SEND" на вывод второму активити. Сделал всё вроде бы так как описано в самоучителе, но при попытке компиляции проекта возникают 4 ошибки:

- Error: (17, 60) error: cannot find symbol variable EXTRA_MESSAGE
- Error: (22, 57) error: cannot find symbol variable activity_display_message
- Error: (21, 25) error: cannot find symbol variable EXTRA_MESSAGE
- Error: Execution failed for task ':app:compileDebugJavaWithJavac'.

> Compilation failed; see the compiler error output for details.

Вот что пишет compiler error output:

C:\Users\User\AndroidStudioProjects\MyFirstApp2\app\src\main\java\com\example\myfirstapp2\DisplayMessageActivity.java:17 : error: cannot find symbol
String message = intent.getStringExtra(MainActivity.EXTRA_MESSAGE);
^
symbol: variable EXTRA_MESSAGE
location: class MainActivity
C:\Users\User\AndroidStudioProjects\MyFirstApp2\app\src\main\java\com\example\myfirstapp2\DisplayMessageActivity.java:22 : error: cannot find symbol
ViewGroup layout = (ViewGroup) findViewById(R.id.activity_display_message);
^
symbol: variable activity_display_message
location: class id
C:\Users\User\AndroidStudioProjects\MyFirstApp2\app\src\main\java\com\example\myfirstapp2\MainActivity.java:21: error: cannot find symbol
intent.putExtra(EXTRA_MESSAGE, message);
^
symbol: variable EXTRA_MESSAGE
location: class MainActivity
3 errors

:app:compileDebugJavaWithJavac FAILED

FAILURE: Build failed with an exception.

* What went wrong:
Execution failed for task ':app:compileDebugJavaWithJavac'.
> Compilation failed; see the compiler error output for details.

* Try:
Run with --stacktrace option to get the stack trace. Run with --info or --debug option to get more log output.

BUILD FAILED

Помогите, пожалуйста, разобраться! Я - новичок и мне пока самому разобраться трудновато. Буду признателен за любую помощь/наставления.
0
Надоела реклама? Зарегистрируйтесь и она исчезнет полностью.
Similar
Эксперт
41792 / 34177 / 6122
Регистрация: 12.04.2006
Сообщений: 57,940
31.07.2016, 11:14
Здравствуйте! Я подобрал для вас темы с ответами на вопрос Gradle build finished with 4 error(s). Android Studio. My First App (Программирование Android):

В android studio - Ошибка: build.gradle error (23,17) - Программирование Android
В android studio - Ошибка: build.gradle error (23,17), только установил, изучаю самостоятельно по книге и видео. Какая может быть причина...

`Gradle build finished with 1 error` в пустом приложении - Программирование Android
Приветствую. Использую Android Studio. Раньше работало; теперь после переустановки системы не хочет собираться даже пустой проект...

Android.support.v4.app.FragmentActivity не работает в Android Studio - Программирование Android
объясните пожалуйста,как в андроид студио добавить вышеуказанную библиотеку,чтобы работало у меня вот это Активити package...

Gradle не формирует проект в Android Studio - Программирование Android
Всем привет! Нужна помощь при создание нового проекта в Android Studio, Gradl выдает ошибку показанную на картинке. В чем может быть...

Ошибка Gradle Java finished with non-zero exit value 2 - Программирование Android
Возникает данная ошибка. Сразу скажу, что здесь я уже был и рекомендации делал: Java finished with non-zero exit value 2

Как настроить gradle в Android Studio на работу с NDK - Программирование Android
Можете дать ссылку на готовый пример или подробное описание как подключить ndk в android studio?? NDK я скачал с сайта распаковал архив и...

17
some_name
Вежливость-главное оружие
226 / 224 / 55
Регистрация: 19.02.2013
Сообщений: 1,441
31.07.2016, 20:42 #16
skypevasily1299, слишком громкие слова, учитывая что это ваше первое приложение
0
skypevasily1299
0 / 0 / 0
Регистрация: 31.07.2016
Сообщений: 8
31.07.2016, 21:01  [ТС] #17
some_name, да ладно, харош, чего громкого-то в моих словах? Учи java/не учи java - а всё равно в каждой конкретной ситуации садиться и разбираться! Что плохого-то в том, что у меня абсолютно нет никакого страха перед разработкой приложений, хоть я и новичок? Зачем сбивать меня с пути истинного, который гласит: "Садитесь и разбирайтесь! Аминь!" Если нужна будет моя помощь в HTML/CSS или с работой CMS разных - обращайся, помогу по мере сил и знаний
0
some_name
Вежливость-главное оружие
226 / 224 / 55
Регистрация: 19.02.2013
Сообщений: 1,441
31.07.2016, 22:24 #18
skypevasily1299, просто, если к большому интузиаму прибавить академический подход, выхлоп будет больше
1
31.07.2016, 22:24
MoreAnswers
Эксперт
37091 / 29110 / 5898
Регистрация: 17.06.2006
Сообщений: 43,301
31.07.2016, 22:24
Привет! Вот еще темы с ответами:

Удаляется библиотека в Android Studio, хотя я уже добавил ее в Gradle - Программирование Android
Пробовал добавлять 2 способами 1) Закинул в папку сразу в AS и нажал Add new Library 2) Закинул в папку Libs и добавил в Graddle ...

Apache POI - build failed (android studio) - Программирование Android
Всем привет! Я столкнулся с проблемой пытаюсь подключить библиотеку Apache POI для работы XWPFDocument в Android studio, но мне выбывает...

При Make project ошибок нет, но при build apk: Error:Execution failed for task ':app:validateConfigSigning'. > - Программирование Android
Полная ошибка: Error:Execution failed for task ':app:validateConfigSigning'. > Keystore file...

Не получается запустить проект (в android studio пишет Gradle 'MyApp' project refresh failed) - Программирование Android
Всем доброе перестал запускаться проект (до этого он тоже не запускался, но хоть кнопка Run работала) сообщения при запуске студии: ...


Искать еще темы с ответами

Или воспользуйтесь поиском по форуму:
18
Ответ Создать тему
Опции темы

КиберФорум - форум программистов, компьютерный форум, программирование
Powered by vBulletin® Version 3.8.9
Copyright ©2000 - 2017, vBulletin Solutions, Inc.
Рейтинг@Mail.ru