Форум программистов, компьютерный форум CyberForum.ru

Программирование Android

Войти
Регистрация
Восстановить пароль
 
 
skypevasily1299
0 / 0 / 0
Регистрация: 31.07.2016
Сообщений: 8
#1

Gradle build finished with 4 error(s). Android Studio. My First App - Программирование Android

31.07.2016, 11:14. Просмотров 618. Ответов 17

Добрый день, уважаемые форумчане!

Я - новичок в программировании под Андройд. Установил себе последнюю версию программы Android Studio с сайта developer.android.com и начал создавать своё первое приложение под Андройд так как это описано в самоучителе https://developer.android.com/training/index.html. Суть приложения сводится к созданию двух активити, в первом вбивается текст и отправляется кнопкой "SEND" на вывод второму активити. Сделал всё вроде бы так как описано в самоучителе, но при попытке компиляции проекта возникают 4 ошибки:

- Error: (17, 60) error: cannot find symbol variable EXTRA_MESSAGE
- Error: (22, 57) error: cannot find symbol variable activity_display_message
- Error: (21, 25) error: cannot find symbol variable EXTRA_MESSAGE
- Error: Execution failed for task ':app:compileDebugJavaWithJavac'.

> Compilation failed; see the compiler error output for details.

Вот что пишет compiler error output:

C:\Users\User\AndroidStudioProjects\MyFirstApp2\app\src\main\java\com\example\myfirstapp2\DisplayMessageActivity.java:17: error: cannot find symbol
String message = intent.getStringExtra(MainActivity.EXTRA_MESSAGE);
^
symbol: variable EXTRA_MESSAGE
location: class MainActivity
C:\Users\User\AndroidStudioProjects\MyFirstApp2\app\src\main\java\com\example\myfirstapp2\DisplayMessageActivity.java:22: error: cannot find symbol
ViewGroup layout = (ViewGroup) findViewById(R.id.activity_display_message);
^
symbol: variable activity_display_message
location: class id
C:\Users\User\AndroidStudioProjects\MyFirstApp2\app\src\main\java\com\example\myfirstapp2\MainActivity.java:21: error: cannot find symbol
intent.putExtra(EXTRA_MESSAGE, message);
^
symbol: variable EXTRA_MESSAGE
location: class MainActivity
3 errors

:app:compileDebugJavaWithJavac FAILED

FAILURE: Build failed with an exception.

* What went wrong:
Execution failed for task ':app:compileDebugJavaWithJavac'.
> Compilation failed; see the compiler error output for details.

* Try:
Run with --stacktrace option to get the stack trace. Run with --info or --debug option to get more log output.

BUILD FAILED

Помогите, пожалуйста, разобраться! Я - новичок и мне пока самому разобраться трудновато. Буду признателен за любую помощь/наставления.
Similar
Эксперт
41792 / 34177 / 6122
Регистрация: 12.04.2006
Сообщений: 57,940
31.07.2016, 11:14     Gradle build finished with 4 error(s). Android Studio. My First App
Посмотрите здесь:
В android studio - Ошибка: build.gradle error (23,17) Android
`Gradle build finished with 1 error` в пустом приложении Android
Android.support.v4.app.FragmentActivity не работает в Android Studio Android
Android Gradle не формирует проект в Android Studio
Ошибка Gradle Java finished with non-zero exit value 2 Android
Android Как настроить gradle в Android Studio на работу с NDK
Android Удаляется библиотека в Android Studio, хотя я уже добавил ее в Gradle
После регистрации реклама в сообщениях будет скрыта и будут доступны все возможности форума.
some_name
Вежливость-главное оружие
221 / 221 / 55
Регистрация: 19.02.2013
Сообщений: 1,431
31.07.2016, 11:43     Gradle build finished with 4 error(s). Android Studio. My First App #2
Цитата Сообщение от skypevasily1299 Посмотреть сообщение
cannot find symbol variable EXTRA_MESSAGE
проверьте, EXTRA_MESSAGE существует?
возможно что при сборке проекта не подтягивается какая-нибудь нужная библиотека
Vladimir93
36 / 36 / 4
Регистрация: 28.06.2015
Сообщений: 151
31.07.2016, 12:08     Gradle build finished with 4 error(s). Android Studio. My First App #3
А что тут не понятно. Не может найти переменные
Error: (17, 60) error: cannot find symbol variable EXTRA_MESSAGE
- Error: (22, 57) error: cannot find symbol variable activity_display_message
- Error: (21, 25) error: cannot find symbol variable EXTRA_MESSAGE
Так же лайот не может найти. Вы видимо половину программы не сделали. Гардел настроили? Ресурсы R. в листинге красным не подчеркнуты?

Добавлено через 13 минут
Тут еще КЭП подсказывает - интернет должен быть подключен. Студя так работает.
skypevasily1299
0 / 0 / 0
Регистрация: 31.07.2016
Сообщений: 8
31.07.2016, 13:16  [ТС]     Gradle build finished with 4 error(s). Android Studio. My First App #4
Цитата Сообщение от some_name Посмотреть сообщение
проверьте, EXTRA_MESSAGE существует?
возможно что при сборке проекта не подтягивается какая-нибудь нужная библиотека
При попытке исправить ошибку с EXTRA_MESSAGE Android Studio предлагает 7 вариантов:
- create class 'EXTRA_MESSAGE'
- create constant field 'EXTRA_MESSAGE'
- create field 'EXTRA_MESSAGE'
- create inner class 'EXTRA_MESSAGE'
- create local variable 'EXTRA_MESSAGE'
- create parameter 'EXTRA_MESSAGE'
- rename reference

Что выбирать?
some_name
Вежливость-главное оружие
221 / 221 / 55
Регистрация: 19.02.2013
Сообщений: 1,431
31.07.2016, 13:31     Gradle build finished with 4 error(s). Android Studio. My First App #5
skypevasily1299, проверьте еще раз тот tutorial, по которому вы это делаете.
вот, прогуглил, и там есть код, где объявляется эта константа:


Кликните здесь для просмотра всего текста

In MainActivity.java, add the code shown below to sendMessage():
Java
1
2
3
4
5
6
7
8
9
10
11
12
13
14
15
16
17
public class MainActivity extends AppCompatActivity {
    public final static String EXTRA_MESSAGE = "com.example.myfirstapp.MESSAGE";
    @Override
    protected void onCreate(Bundle savedInstanceState) {
        super.onCreate(savedInstanceState);
        setContentView(R.layout.activity_main);
    }
 
    /** Called when the user clicks the Send button */
    public void sendMessage(View view) {
        Intent intent = new Intent(this, DisplayMessageActivity.class);
        EditText editText = (EditText) findViewById(R.id.edit_message);
        String message = editText.getText().toString();
        intent.putExtra(EXTRA_MESSAGE, message);
        startActivity(intent);
    }
}
skypevasily1299
0 / 0 / 0
Регистрация: 31.07.2016
Сообщений: 8
31.07.2016, 13:31  [ТС]     Gradle build finished with 4 error(s). Android Studio. My First App #6
Цитата Сообщение от Vladimir93 Посмотреть сообщение
А что тут не понятно. Не может найти переменные

Так же лайот не может найти. Вы видимо половину программы не сделали. Гардел настроили? Ресурсы R. в листинге красным не подчеркнуты?

Добавлено через 13 минут
Тут еще КЭП подсказывает - интернет должен быть подключен. Студя так работает.
Я не знаю, сделал я половину программы или не сделал, но я сделал всё так, как предложено в обучающем курсе на сайте developer.android.com, откуда я скачивал последнюю версию программы Android Studio. Что значит - настроил ли я гардел? Как его можно и нужно настроить? Что такое листинг? В файле MainActivity.java ресурсы R. красным не подчёркнуты. Интернет подключён.

П.Сы. Ребят, на будущее, не надо здесь пальцы гнуть, я вопрос задал не для того, чтобы размерами членов помериться, а для того, чтобы получить на него ответ. Всем спасибо.
Pablito
2455 / 1900 / 591
Регистрация: 12.05.2014
Сообщений: 6,702
Завершенные тесты: 1
31.07.2016, 13:34     Gradle build finished with 4 error(s). Android Studio. My First App #7
Андроид на русском произносится и пишется через "и"
и если внимательно читать тот самоучитель, но можно в коде найти что же такое EXTRA_MESSAGE

Добавлено через 1 минуту
Цитата Сообщение от skypevasily1299 Посмотреть сообщение
Ребят, на будущее, не надо здесь пальцы гнуть, я вопрос задал не для того, чтобы размерами членов помериться, а для того, чтобы получить на него ответ. Всем спасибо.
и да, на будущее - тебе в интернете никто ничем не обязан и я могу точно также сказать - некрасиво рассказывать другим что делать, а что не делать, особенно, если ты ждешь от кого-то помощи
skypevasily1299
0 / 0 / 0
Регистрация: 31.07.2016
Сообщений: 8
31.07.2016, 13:39  [ТС]     Gradle build finished with 4 error(s). Android Studio. My First App #8
some_name
Сделал всё так, как именно в этом уроке и описано (именно этот урок и делал), и получил именно те ошибки, о которых я писал... хм
some_name
Вежливость-главное оружие
221 / 221 / 55
Регистрация: 19.02.2013
Сообщений: 1,431
31.07.2016, 13:42     Gradle build finished with 4 error(s). Android Studio. My First App #9
skypevasily1299, т.е. вы добавили константу в класс MainActivity и все равно получаете cannot find symbol variable EXTRA_MESSAGE?
some_name
Вежливость-главное оружие
221 / 221 / 55
Регистрация: 19.02.2013
Сообщений: 1,431
31.07.2016, 13:42     Gradle build finished with 4 error(s). Android Studio. My First App #10
skypevasily1299, вообщем, не вы первый столкнулись с подобной проблемой
skypevasily1299
0 / 0 / 0
Регистрация: 31.07.2016
Сообщений: 8
31.07.2016, 13:46  [ТС]     Gradle build finished with 4 error(s). Android Studio. My First App #11
Цитата Сообщение от some_name Посмотреть сообщение
skypevasily1299, т.е. вы добавили константу в класс MainActivity и все равно получаете cannot find symbol variable EXTRA_MESSAGE?
Сейчас 2 ошибки:
- Error: (11, 49) error: illegal start of expression
- Error: Execution failed for task ':app:compileDebugJavaWithJavac'.
> Compilation failed; see the compiler error output for details.

Как правильно написать это выражение:

private static final String EXTRA_MESSAGE = ;

???

Что нужно писать где 'String' и после знака '='?
skypevasily1299
0 / 0 / 0
Регистрация: 31.07.2016
Сообщений: 8
31.07.2016, 18:59  [ТС]     Gradle build finished with 4 error(s). Android Studio. My First App #12
skypevasily1299, вообщем, не вы первый столкнулись с подобной проблемой
Спасибо большое. Постараюсь разобраться. В любом случае 2 ошибки - это уже не 4 ошибки, уже попроще

Добавлено через 4 часа 37 минут
Спасибо всем огромное! Оказывается дело было вот в чём:

1) In MainActivity.java, add the code shown below to sendMessage():

Java
1
2
3
4
5
6
7
8
9
10
11
12
13
14
15
16
17
public class MainActivity extends AppCompatActivity {
    public final static String EXTRA_MESSAGE = "com.example.myfirstapp.MESSAGE"; // <--- !!!
    @Override
    protected void onCreate(Bundle savedInstanceState) {
        super.onCreate(savedInstanceState);
        setContentView(R.layout.activity_main);
    }
 
    /** Called when the user clicks the Send button */
    public void sendMessage(View view) {
        Intent intent = new Intent(this, DisplayMessageActivity.class);
        EditText editText = (EditText) findViewById(R.id.edit_message);
        String message = editText.getText().toString();
        intent.putExtra(EXTRA_MESSAGE, message);
        startActivity(intent);
    }
}
2) Оказывается вот эта сносочка была очень важной(!!!!!!!!):
Note: The XML layout generated by previous versions of Android Studio might not include the android:id attribute. The call findViewById() will fail if the layout does not have the android:id attribute. If this is the case, open activity_display_message.xml and add the attribute android:id="@+id/activity_display_message" to the layout element.
Я в файле activity_display_message.xml добавил строку android:id="@+id/activity_display_message" и у меня усё заработало! Ура! Первое приложение я создал!
powowstal
28 / 28 / 4
Регистрация: 21.03.2013
Сообщений: 303
31.07.2016, 19:13     Gradle build finished with 4 error(s). Android Studio. My First App #13
Цитата Сообщение от skypevasily1299 Посмотреть сообщение
Что нужно писать где 'String' и после знака '='?
это капец, возьмите учебник по java, потому что без весел на лодке не поплаваешь
some_name
Вежливость-главное оружие
221 / 221 / 55
Регистрация: 19.02.2013
Сообщений: 1,431
31.07.2016, 19:52     Gradle build finished with 4 error(s). Android Studio. My First App #14
powowstal, да, без основ будет тяжко
MoreAnswers
Эксперт
37091 / 29110 / 5898
Регистрация: 17.06.2006
Сообщений: 43,301
31.07.2016, 20:15     Gradle build finished with 4 error(s). Android Studio. My First App
Еще ссылки по теме:
При Make project ошибок нет, но при build apk: Error:Execution failed for task ':app:validateConfigSigning'. > Android
Android Не получается запустить проект (в android studio пишет Gradle 'MyApp' project refresh failed)
Android MinifyEnabled в build.gradle
Android TargetSdkVersion в build.gradle
Как открыть проект в Android Studio, состоящий из одного модуля app Android

Искать еще темы с ответами

Или воспользуйтесь поиском по форуму:
skypevasily1299
0 / 0 / 0
Регистрация: 31.07.2016
Сообщений: 8
31.07.2016, 20:15  [ТС]     Gradle build finished with 4 error(s). Android Studio. My First App #15
powowstal, some_name, Ребят, тема закрыта, я свою проблему решил, причём сам безо всяких учебников по java и иже с ними, причём и другим отписал как эта проблема решается . Вам пример, когда без вёсел на лодке поплаваешь? Пожалуйста: яхта, скутер, катамаран, лодка с мотором, то есть с двигателем, в конце концов Без основ чего будет тяжко? Гребли на лодке? Ха-ха!
Yandex
Объявления
31.07.2016, 20:15     Gradle build finished with 4 error(s). Android Studio. My First App
Ответ Создать тему
Опции темы

КиберФорум - форум программистов, компьютерный форум, программирование
Powered by vBulletin® Version 3.8.9
Copyright ©2000 - 2017, vBulletin Solutions, Inc.
Рейтинг@Mail.ru