Форум программистов, компьютерный форум, киберфорум
Наши страницы
Программирование Android
Войти
Регистрация
Восстановить пароль
 
Saiberg
19 / 19 / 2
Регистрация: 23.09.2010
Сообщений: 193
1

STL и другие библиотеки

18.09.2012, 20:37. Просмотров 888. Ответов 0
Метки нет (Все метки)

По какой-то для меня не понятной причине не подтягиваются инклюды.

Лог сборки.

23:28:39 **** Incremental Build of configuration Default for project TestNativeApp ****
ndk-build.cmd V=1
"Compile++ thumb : TestNativeApp <= TestNativeApp.cpp

E:/android-ndk-r8b-windows/android-ndk-r8b/toolchains/arm-linux-androideabi-4.6/prebuilt/windows/bin/arm-linux-androideabi-g++ -MMD -MP -MF ./obj/local/armeabi/objs/TestNativeApp/TestNativeApp.o.d -fpic -ffunction-sections -funwind-tables -fstack-protector -D__ARM_ARCH_5__ -D__ARM_ARCH_5T__ -D__ARM_ARCH_5E__ -D__ARM_ARCH_5TE__ -march=armv5te -mtune=xscale -msoft-float -fno-exceptions -fno-rtti -mthumb -Os -fomit-frame-pointer -fno-strict-aliasing -finline-limit=64 -IE:\android-ndk-r8b-windows\android-ndk-r8b\sources\cxx-stl\gnu-libstdc++\4.6 -IE:/android-ndk-r8b-windows/android-ndk-r8b/sources/cxx-stl/system/include -Ijni -DANDROID -Wa,--noexecstack -O2 -DNDEBUG -g -IE:/android-ndk-r8b-windows/android-ndk-r8b/platforms/android-14/arch-arm/usr/include -c jni/TestNativeApp.cpp -o ./obj/local/armeabi/objs/TestNativeApp/TestNativeApp.o
jni/TestNativeApp.cpp:6:18: fatal error: vector: No such file or directory
compilation terminated.
make: *** [obj/local/armeabi/objs/TestNativeApp/TestNativeApp.o] Error 1
видно, что инклюды передаются
-IE:\android-ndk-r8b-windows\android-ndk-r8b\sources\cxx-stl\gnu-libstdc++\4.6
С другими либами так же. В чем косяк ?

Добавлено через 10 минут
Лог сборки проекта с бустом:
23:34:50 **** Incremental Build of configuration Default for project TestNativeApp ****
ndk-build.cmd V=1
"Compile++ thumb : TestNativeApp <= TestNativeApp.cpp

E:/android-ndk-r8b-windows/android-ndk-r8b/toolchains/arm-linux-androideabi-4.6/prebuilt/windows/bin/arm-linux-androideabi-g++ -MMD -MP -MF ./obj/local/armeabi/objs/TestNativeApp/TestNativeApp.o.d -fpic -ffunction-sections -funwind-tables -fstack-protector -D__ARM_ARCH_5__ -D__ARM_ARCH_5T__ -D__ARM_ARCH_5E__ -D__ARM_ARCH_5TE__ -march=armv5te -mtune=xscale -msoft-float -fno-exceptions -fno-rtti -mthumb -Os -fomit-frame-pointer -fno-strict-aliasing -finline-limit=64 -IE:\boost_1_51_0 -IE:/android-ndk-r8b-windows/android-ndk-r8b/sources/cxx-stl/system/include -Ijni -DANDROID -Wa,--noexecstack -O2 -DNDEBUG -g -IE:/android-ndk-r8b-windows/android-ndk-r8b/platforms/android-14/arch-arm/usr/include -c jni/TestNativeApp.cpp -o ./obj/local/armeabi/objs/TestNativeApp/TestNativeApp.o
In file included from E:\boost_1_51_0/boost/smart_ptr/shared_ptr.hpp:27:0,
from E:\boost_1_51_0/boost/shared_ptr.hpp:17,
from jni/TestNativeApp.cpp:4:
E:\boost_1_51_0/boost/config/no_tr1/memory.hpp:21:20: fatal error: memory: No such file or directory
compilation terminated.
make: *** [obj/local/armeabi/objs/TestNativeApp/TestNativeApp.o] Error 1
Файл в по этому пути существует.
0
Similar
Эксперт
41792 / 34177 / 6122
Регистрация: 12.04.2006
Сообщений: 57,940
18.09.2012, 20:37
Ответы с готовыми решениями:

Как в ndk добавить stl классы?
В Application.mk добавил APP_STL := stlport_static и все равно ndk-build не...

Yandex mapkit и другие
Здравствуйте. Нужно встроить в приложение карту для наглядного местоположения...

OnNavigationItemSelected, как подгружать другие активити?
Всем привет, столкнулся с такой проблемой. Не пойму как правильно при помощи...

Адаптировать layout под другие устройства
Добрый. Как на всех устройствах в Android Studio отображать все блоки одинаково...

Переход на другие активности из Navigation Drawer
Добрый день. Столкнулся с проблемой после того как прочитал статью на хабре о...

0
MoreAnswers
Эксперт
37091 / 29110 / 5898
Регистрация: 17.06.2006
Сообщений: 43,301
18.09.2012, 20:37

TableLayout добавить строки в другие столбцы
Добрый день. Есть такой код. Но TextView добавляются снизу. Как сделать чтобы...

Как посмотреть какие библиотеки тянут другие библиотеки процесса
Привет, есть процесс, у него подтянуты dll'ки список которых я могу...

библиотеки stl
#include &quot;stdafx.h&quot; #include&lt;string&gt; #include&lt;queue&gt; #include&lt;fstream&gt;...


Искать еще темы с ответами

Или воспользуйтесь поиском по форуму:
1
Ответ Создать тему
Опции темы

КиберФорум - форум программистов, компьютерный форум, программирование
Powered by vBulletin® Version 3.8.9
Copyright ©2000 - 2018, vBulletin Solutions, Inc.
Рейтинг@Mail.ru