Форум программистов, компьютерный форум CyberForum.ru
Наши страницы

С++ для начинающих

Войти
Регистрация
Восстановить пароль
 
Pokemon_93
9 / 5 / 1
Регистрация: 19.01.2013
Сообщений: 74
#1

atlapp.h vs2013 error c2039 AtlGetCommCtrlVersion: не является членом "ATL" - C++

16.01.2014, 02:57. Просмотров 1141. Ответов 0
Метки нет (Все метки)

доброе время суток уважаемые форумчане.
только начал использовать atl, и сразу столкнулся с такой проблемой. может кто знает решение данной проблемы, поделитесь пожалуйста советом что мне делать с этим.
ниже прилагаю лог ошибок который выдала мне студия

1>------ Сборка начата: проект: lab2_1, Конфигурация: Debug Win32 ------
1> stdafx.cpp
1>c:\program files (x86)\microsoft visual studio 12.0\vc\atlmfc\include\atlapp.h(500): warning C4996: 'GetVersionExW': объявлен deprecate
1> c:\program files (x86)\windows kits\8.1\include\um\sysinfoapi.h(442): см. объявление "GetVersionExW"
1>c:\program files (x86)\microsoft visual studio 12.0\vc\atlmfc\include\atlapp.h(602): error C2039: AtlGetCommCtrlVersion: не является членом "ATL"
1>c:\program files (x86)\microsoft visual studio 12.0\vc\atlmfc\include\atlapp.h(602): error C3861: AtlGetCommCtrlVersion: идентификатор не найден

Добавлено через 22 минуты
всем спасибо, вопрос решен подключением сторонней библиотеки atl не входящей в состав студии.
0
Similar
Эксперт
41792 / 34177 / 6122
Регистрация: 12.04.2006
Сообщений: 57,940
16.01.2014, 02:57
Здравствуйте! Я подобрал для вас темы с ответами на вопрос atlapp.h vs2013 error c2039 AtlGetCommCtrlVersion: не является членом "ATL" (C++):

Error C2039: fprintf: не является членом "`global namespace'" - C++
просто не понимаю откуда берется такая ошибка? вроде все правильно пишу... Заголовки функций #pragma once #include <string> ...

Error C2039: list: не является членом "std" - C++
итак: делаю MFC проект. Собственные функции пишу в отдельном MyLibrary.cpp к которому еще прилагается MyLibrary.h. функция написана,...

Error C2039: print не является членом "car" - C++
Добрый день, столкнулся с проблемой " error C2039: print: не является членом "car" " при создания класса. Почему оно не хочет выводить ? ...

Как исправить ошибку error C2039 "не является членом класса"? - C++
\Employee.cpp(20) : error C2039: YearsofService: не является членом "Employee" 1> c:\users\кварц3\desktop\student\решенные задачи...

Error C2039: Insert: не является членом "std::set<_Kty>" - C++
Ругается компилятор: 1&gt;c:\visual studio 2008\projects\lab1\fibo\fibo\fibo.cpp(19) : error C2039: Insert: не является членом...

Error C2039: + не является членом "CLongArithmetic" - C++
Можете обьяснить что не так? Не могу понять( error C2511: const CLongArithmetic CLongArithmetic::operator -(CLongArithmetic,const...

Надоела реклама? Зарегистрируйтесь и она исчезнет полностью.
MoreAnswers
Эксперт
37091 / 29110 / 5898
Регистрация: 17.06.2006
Сообщений: 43,301
16.01.2014, 02:57
Привет! Вот еще темы с ответами:

Error C2039 не является членом Znak - C++
#include &lt;iostream&gt; #include &lt;string&gt; struct ZNAK { public: char *name, *surname; // Имя и фамилия соответственно char...

Найти причины и способы исправления ошибки "Функция не является членом класса" - C++
Хай. Вижла сошла сума, то ли я уже переработал. #pragma once #ifndef CMATRIXH # define CMATRIXH class CMatrix { double...

strind: не является членом "std" - C++
Доброго времени суток. Осваиваю классы в С++ по учебнику самостоятльно. Перепечатал прогу правильно, но выдает следущие ошибки: ...

Ошибка при компиляции In function"int main()"; expected ';', before "cin", [Build Error] [main.o] Error 1 - C++
Книга &quot;Основы программирования на C++ том 1&quot;(Стэнли Б.Липпман). Приводится пример кода. #include &lt;iostream&gt; #include &lt;string&gt; using...


Искать еще темы с ответами

Или воспользуйтесь поиском по форуму:
Ответ Создать тему
Опции темы

КиберФорум - форум программистов, компьютерный форум, программирование
Powered by vBulletin® Version 3.8.9
Copyright ©2000 - 2017, vBulletin Solutions, Inc.
Рейтинг@Mail.ru