Форум программистов, компьютерный форум CyberForum.ru

Компилятор не хочит выполнять свою работу правильно - C++

Восстановить пароль Регистрация
 
HelpMeDelphi
0 / 0 / 0
Регистрация: 10.01.2014
Сообщений: 12
20.01.2014, 11:57     Компилятор не хочит выполнять свою работу правильно #1
Вот код:
C++
1
2
3
4
5
6
7
8
9
10
11
12
13
14
15
16
17
18
19
20
21
22
23
24
25
26
// test1.cpp : Defines the entry point for the console application.
//
#include <stdafx.h>
#include <iostream>
#include <string>
std::string name;
using namespace std;
 
int _tmain(int argc, _TCHAR* argv[])
{
    int size; // размер массива
    cout << "The array size: ";
    cin >> size; // получение размера массива
 
    int *massive = new int[size]; // Выделение памяти для массива
    
    for (int i = 0; i <= size; i++) { //  Цикл заполнения массива 
        massive[i] = i;
    }
    
    for (int i = size; i != 0 ; i--) { //  Цикл вывод значений его элементов(в обратном порядке)
       cout << "Value of " << i << " element is " << massive[i] << endl;
    }
    system("pause");  // задержка консоли
    return 0;
}
Visual Studio 2005

Ошибка:

Код
- Build started: Project: 12, Configuration: Debug Win32 —----
1>Compiling...
1>12.cpp
1>d:\12\12\12\12.cpp(11) : error C2146: syntax error : missing ';' before identifier '«'
1>d:\12\12\12\12.cpp(11) : error C2065: '«' : undeclared identifier
1>d:\12\12\12\12.cpp(11) : error C2143: syntax error : missing ';' before 'string'
1>d:\12\12\12\12.cpp(12) : error C2146: syntax error : missing ';' before identifier '»'
1>d:\12\12\12\12.cpp(12) : error C2065: '»' : undeclared identifier
1>d:\12\12\12\12.cpp(12) : error C2146: syntax error : missing ';' before identifier 'size'
1>d:\12\12\12\12.cpp(17) : error C2065: 'i' : undeclared identifier
1>d:\12\12\12\12.cpp(21) : error C2146: syntax error : missing ';' before identifier '«'
1>d:\12\12\12\12.cpp(21) : error C2143: syntax error : missing ';' before 'string'
1>d:\12\12\12\12.cpp(21) : error C2146: syntax error : missing ';' before identifier '«'
1>d:\12\12\12\12.cpp(21) : error C2146: syntax error : missing ';' before identifier 'i'
1>d:\12\12\12\12.cpp(21) : error C2146: syntax error : missing ';' before identifier '«'
1>d:\12\12\12\12.cpp(21) : error C2143: syntax error : missing ';' before 'string'
1>d:\12\12\12\12.cpp(21) : error C2146: syntax error : missing ';' before identifier '«'
1>d:\12\12\12\12.cpp(21) : error C2146: syntax error : missing ';' before identifier 'massive'
1>d:\12\12\12\12.cpp(21) : error C2146: syntax error : missing ';' before identifier '«'
1>d:\12\12\12\12.cpp(21) : error C2146: syntax error : missing ';' before identifier 'endl'
1>d:\12\12\12\12.cpp(21) : warning C4551: function call missing argument list
1>Build log was saved at "file://d:\12\12\12\Debug\BuildLog.htm"
1>12 - 17 error(s), 1 warning(s)
========== Build: 0 succeeded, 1 failed, 0 up-to-date, 0 skipped ==========
Similar
Эксперт
41792 / 34177 / 6122
Регистрация: 12.04.2006
Сообщений: 57,940
20.01.2014, 11:57     Компилятор не хочит выполнять свою работу правильно
Посмотрите здесь:

C++ Программа завершает свою работу и закрытаеться
Я понял, мало кто знает, как ПРАВИЛЬНО интегрировать Internet Explorer в свою :-) окно... C++
Правильно ли я понимаю ссылки и указатели. Работу с ними. Я сам прокомментировал код. Скажите правильно или нет. C++
C++ Правильно ли я понимаю работу этого кода?
Как правильно создать свою DLL ? C++
После регистрации реклама в сообщениях будет скрыта и будут доступны все возможности форума.
Nullik
 Аватар для Nullik
43 / 12 / 1
Регистрация: 13.03.2013
Сообщений: 297
Завершенные тесты: 1
20.01.2014, 12:03     Компилятор не хочит выполнять свою работу правильно #2
у меня всё норм, единственное что:

#include <stdafx.h> --> #include "stdafx.h"
Ev[G]eN
Эксперт С++
 Аватар для Ev[G]eN
5093 / 1531 / 381
Регистрация: 23.01.2011
Сообщений: 3,148
20.01.2014, 12:06     Компилятор не хочит выполнять свою работу правильно #3
а так?
C++
1
2
3
4
5
6
7
8
9
10
11
12
13
14
15
16
17
18
19
20
21
22
23
24
#include <iostream>
 
using namespace std;
 
int main()
{
    int size; // размер массива
    cout << "The array size: ";
    cin >> size; // получение размера массива
 
    int *massive = new int[size]; // Выделение памяти для массива
 
    for (int i = 0; i < size; i++) { //  Цикл заполнения массива 
        massive[i] = (i + 1);
    }
 
    for (int i = size - 1; i >= 0; i--) { //  Цикл вывод значений его элементов(в обратном порядке)
        cout << "Value of " << (i + 1) << " element is " << massive[i] << endl;
    }
    delete [] massive;
 
    system("pause");  // задержка консоли
    return 0;
}
castaway
Эксперт С++
4837 / 2976 / 367
Регистрация: 10.11.2010
Сообщений: 11,008
Записей в блоге: 10
Завершенные тесты: 1
20.01.2014, 12:34     Компилятор не хочит выполнять свою работу правильно #4
Что-то мне подсказывает, что ты заместо стрелок << и >> обычные кавычки поставил.
Ev_Hyper
 Аватар для Ev_Hyper
1805 / 1626 / 435
Регистрация: 15.12.2013
Сообщений: 5,773
20.01.2014, 13:17     Компилятор не хочит выполнять свою работу правильно #5
HelpMeDelphi, попробуйте так:
C++
1
2
3
4
5
6
7
8
9
10
11
12
13
14
15
16
17
18
19
20
#include <iostream.h>
 
int main()
{
    int size; 
    cout << "The array size: ";
    cin >> size;
 
    int *massive = new int[size];
    int i=0;
    for (i = 0; i < size; i++) { 
        massive[i] = i;
    }
    
    for (i = size-1; i >= 0 ; i--) { 
       cout << "Value of " << i << " element is " << massive[i] << endl;
    }
    system("pause"); 
    return 0;
}
Ev[G]eN
Эксперт С++
 Аватар для Ev[G]eN
5093 / 1531 / 381
Регистрация: 23.01.2011
Сообщений: 3,148
20.01.2014, 13:18     Компилятор не хочит выполнять свою работу правильно #6
Цитата Сообщение от Ev_Hyper Посмотреть сообщение
C++
1
2
int i=0;
for (i = 0; i < size; i++) {
Вы серьезно?
Ev_Hyper
 Аватар для Ev_Hyper
1805 / 1626 / 435
Регистрация: 15.12.2013
Сообщений: 5,773
20.01.2014, 13:20     Компилятор не хочит выполнять свою работу правильно #7
Ev[G]eN, да, VS6 не понимает определения переменной в цикле. Я подумал, что 5 действует аналогично.
Ev[G]eN
Эксперт С++
 Аватар для Ev[G]eN
5093 / 1531 / 381
Регистрация: 23.01.2011
Сообщений: 3,148
20.01.2014, 13:21     Компилятор не хочит выполнять свою работу правильно #8
я имел ввиду что два раза приравняли i к нулю
MoreAnswers
Эксперт
37091 / 29110 / 5898
Регистрация: 17.06.2006
Сообщений: 43,301
20.01.2014, 13:26     Компилятор не хочит выполнять свою работу правильно
Еще ссылки по теме:

C++ Программа останавливает свою работу, когда начинает выполнятся функция. Метод хорд
Как правильно переделать программу с двумерным массивом под работу с указателями? C++
Как выполнять файл начинаю он вылетает C++

Искать еще темы с ответами

Или воспользуйтесь поиском по форуму:
Ev_Hyper
 Аватар для Ev_Hyper
1805 / 1626 / 435
Регистрация: 15.12.2013
Сообщений: 5,773
20.01.2014, 13:26     Компилятор не хочит выполнять свою работу правильно #9
точно
Yandex
Объявления
20.01.2014, 13:26     Компилятор не хочит выполнять свою работу правильно
Ответ Создать тему
Опции темы

Текущее время: 13:34. Часовой пояс GMT +3.
КиберФорум - форум программистов, компьютерный форум, программирование
Powered by vBulletin® Version 3.8.9
Copyright ©2000 - 2016, vBulletin Solutions, Inc.
Рейтинг@Mail.ru