Форум программистов, компьютерный форум CyberForum.ru
Наши страницы

С++ для начинающих

Войти
Регистрация
Восстановить пароль
 
Лаборант23
0 / 0 / 0
Регистрация: 29.01.2014
Сообщений: 6
#1

Ошибка кода Syntax error: missing ')' before ';' - C++

24.03.2014, 23:32. Просмотров 345. Ответов 1
Метки нет (Все метки)

В чем ошибка данного кода
C++
1
2
3
4
5
6
7
8
9
10
11
12
double b;
double c;
double m;
double a=(2+sin(2.0)/(sin(5.0)+5);
 
cout<<a<<endl;
 
 
 
system("pause");
    
}
Build started: Project: my, Configuration: Debug Win32 ------
1> my.cpp
1>my.cpp(14): error C2143: syntax error : missing ')' before ';'
========== Build: 0 succeeded, 1 failed, 0 up-to-date, 0 skipped ==========
0
Надоела реклама? Зарегистрируйтесь и она исчезнет полностью.
Similar
Эксперт
41792 / 34177 / 6122
Регистрация: 12.04.2006
Сообщений: 57,940
24.03.2014, 23:32
Здравствуйте! Я подобрал для вас темы с ответами на вопрос Ошибка кода Syntax error: missing ')' before ';' (C++):

Ошибка error C2146: syntax error : missing ';' before identifier 'alph' - C++
Не получается откомпилировать прогу из консоля в MFC, выбивает ошибку error C2146: syntax error : missing ';' before identifier 'alph' ...

Ошибка в yvals.h - Syntax error:missing ';' before 'namespace' - C++
Изучаю c++, раньше работал в codeblocks, теперь перешёл на студию и столкнулся с такой ошибкой: error C2143: syntax error : missing ';'...

Ошибка в тестовом примере: "Error 1 error C2143: syntax error : missing ';' before 'if'" - C++
#include&lt;iostream&gt; using namespace std; int main(){ int x, a = 0, b = 10; (cin &gt;&gt; x).get(); while (x){ int c = x % 10; ...

Syntax error : missing ')' before ';' - C++
пишу программу подсчета значения функции, вроде уже везде где надо поставила скобочки, ковычки и завершающие ; пишет ошибку syntax error...

Error C2143: syntax error : missing ';' before '.' - C++
#include &lt;fstream&gt; #include &lt;iostream&gt; using std::cin; using std::cout; using std::endl; using std::ifstream; using...

ошибка declaration syntax error - C++
Добрый вечер! помогите пожалуйста разобраться в коде - написал подпрограмму по анимации символов,//gorovenko taras #include &lt;conio.h&gt; ...

1
vantaqa
0 / 0 / 0
Регистрация: 20.05.2012
Сообщений: 16
24.03.2014, 23:35 #2
не хватает закрывающий скобки в первом слагаемом
должно быть так :
C++
1
2
3
4
5
6
7
8
9
10
11
12
double b;
double c;
double m;
double a=(2+sin(2.0))/(sin(5.0)+5);
 
cout<<a<<endl;
 
 
 
system("pause");
    
}
0
MoreAnswers
Эксперт
37091 / 29110 / 5898
Регистрация: 17.06.2006
Сообщений: 43,301
24.03.2014, 23:35
Привет! Вот еще темы с ответами:

Ошибка syntax error before `(' token - C++
Помогите плз. Нужно 3 прoги на 1 условие используя For, While(), Do...While. Сумма 1/sin(1) + 1/(sin(1) + sin(2)) + … +...

Ошибка [C++ Error] Unit1.cpp(5): E2139 Declaration missing ; - C++
Ошибка Unit1.cpp(5): E2139 Declaration missing ; Падает на строчку: int main () Исходник : ...

Выдается ошибка при компиляции (error C2447: missing function header (old-style formal list?)) - C++
не работает программа, выдает ошибку C:\Program Files\Microsoft Visual Studio\MyProjects\564356765456\cfvb n.cpp(6) : error C2447:...

Ошибка "error C4430: missing type specifier" при работе с fstream - C++
Добрый день. Работаю над сохранением и загрузкой файлов. Для этого использую библиотеку &lt;fstream&gt;, создаю обьект класса fstream. А...


Искать еще темы с ответами

Или воспользуйтесь поиском по форуму:
2
Ответ Создать тему
Опции темы

КиберФорум - форум программистов, компьютерный форум, программирование
Powered by vBulletin® Version 3.8.9
Copyright ©2000 - 2017, vBulletin Solutions, Inc.
Рейтинг@Mail.ru