Форум программистов, компьютерный форум CyberForum.ru

С++ для начинающих

Войти
Регистрация
Восстановить пароль
 
Рейтинг: Рейтинг темы: голосов - 24, средняя оценка - 4.75
_Maxim_
0 / 0 / 0
Регистрация: 18.04.2014
Сообщений: 4
#1

Ошибка при компиляции In function"int main()"; expected ';', before "cin", [Build Error] [main.o] Error 1 - C++

21.04.2014, 12:27. Просмотров 3789. Ответов 4
Метки нет (Все метки)

Книга "Основы программирования на C++ том 1"(Стэнли Б.Липпман).
Приводится пример кода.
C++
1
2
3
4
5
6
7
8
9
10
11
12
13
14
15
#include <iostream>
#include <string>
using namespace std;
 
int main()
{
    string user_name;
    cout << " Введите ваше имя,пожалуйста: "
    cin >> user_name
    cout << '\n'
         << " Здравствуйте,"
         << user_name
         << " ... и досвидания!\n";
    return 0;
}
При вводе этого кода выдает ошибки.
In function"int main()";
expected ';', before "cin"
[Build Error] [main.o] Error 1

В журнале компиляции
Код
Компилятор: Default compiler
Building Makefile: "C:\Users\Администратор\Desktop\Makefile.win"
Выполнение  make...
make.exe -f "C:\Users\Администратор\Desktop\Makefile.win" all
g++.exe -c main.cpp -o main.o -I"D:/Dev-Cpp/lib/gcc/mingw32/3.4.2/include"  -I"D:/Dev-Cpp/include/c++/3.4.2/backward"  -I"D:/Dev-Cpp/include/c++/3.4.2/mingw32"  -I"D:/Dev-Cpp/include/c++/3.4.2"  -I"D:/Dev-Cpp/include"   

main.cpp: In function `int main()':
main.cpp:9: error: expected `;' before "cin"

make.exe: *** [main.o] Error 1

Выполнение завершено
Миниатюры
Ошибка при компиляции In function"int main()"; expected ';', before "cin", [Build Error] [main.o] Error 1   Ошибка при компиляции In function"int main()"; expected ';', before "cin", [Build Error] [main.o] Error 1  
Лучшие ответы (1)
Similar
Эксперт
41792 / 34177 / 6122
Регистрация: 12.04.2006
Сообщений: 57,940
21.04.2014, 12:27     Ошибка при компиляции In function"int main()"; expected ';', before "cin", [Build Error] [main.o] Error 1
Посмотрите здесь:

Ошибка: "main" должен вернуть "int'' C++
возвращаемый тип "main" должен быть "int", а не C++
C++ error C2040: key: "int [256]" отличается по уровням косвенного обращения от "std::ofstream"
C++ In function ‘int main()’: error: expected ‘(’ before ‘n’
C++ VS2010 разница между "int _tmain()" и "int main()"
Ошибка компиляции: error C2562: main: функция типа "void" C++
C++ Выдает ошибку c:\proect\8\8\8.cpp(60): error C2040: ==: "char [20]" отличается по уровням косвенного обращения от "int"
C++ Error C2440: <function-style-cast>: невозможно преобразовать "unsigned int" в "std::bitset<_Bits>"
C++ При компиляции кода вылазит ошибка "error C2027: use of undefined type 'SldWorks'"
C++ Компилятор выдает ошибку " in function int main ()"
Ошибка в функции main: "expected ';' before 'return'" C++
Ошибка при компиляции "error C2088: <<: недопустимо для class" C++

Искать еще темы с ответами

Или воспользуйтесь поиском по форуму:
После регистрации реклама в сообщениях будет скрыта и будут доступны все возможности форума.
petyahohlov
27 / 22 / 5
Регистрация: 31.07.2013
Сообщений: 121
21.04.2014, 12:33     Ошибка при компиляции In function"int main()"; expected ';', before "cin", [Build Error] [main.o] Error 1 #2
там же указано где ошибка.
после cin не стоит точка с запятой
_Maxim_
0 / 0 / 0
Регистрация: 18.04.2014
Сообщений: 4
21.04.2014, 12:34  [ТС]     Ошибка при компиляции In function"int main()"; expected ';', before "cin", [Build Error] [main.o] Error 1 #3
Если ставлю ничего не происходит. Такие же ошибки.
petyahohlov
27 / 22 / 5
Регистрация: 31.07.2013
Сообщений: 121
21.04.2014, 12:35     Ошибка при компиляции In function"int main()"; expected ';', before "cin", [Build Error] [main.o] Error 1 #4
Сообщение было отмечено автором темы, экспертом или модератором как ответ
и после первого cout тоже точка с зяпятой пропущена. а в примере кстати все правильно
_Maxim_
0 / 0 / 0
Регистрация: 18.04.2014
Сообщений: 4
21.04.2014, 12:37  [ТС]     Ошибка при компиляции In function"int main()"; expected ';', before "cin", [Build Error] [main.o] Error 1 #5
Спасибо. Нашем где пропустил).
Yandex
Объявления
21.04.2014, 12:37     Ошибка при компиляции In function"int main()"; expected ';', before "cin", [Build Error] [main.o] Error 1
Ответ Создать тему
Опции темы

КиберФорум - форум программистов, компьютерный форум, программирование
Powered by vBulletin® Version 3.8.9
Copyright ©2000 - 2017, vBulletin Solutions, Inc.
Рейтинг@Mail.ru