Форум программистов, компьютерный форум, киберфорум
Наши страницы

С++ для начинающих

Войти
Регистрация
Восстановить пароль
 
AndBo
0 / 0 / 0
Регистрация: 18.04.2014
Сообщений: 3
#1

Ошибка в yvals.h - Syntax error:missing ';' before 'namespace' - C++

22.04.2014, 20:31. Просмотров 1006. Ответов 4
Метки нет (Все метки)

Изучаю c++, раньше работал в codeblocks, теперь перешёл на студию и столкнулся с такой ошибкой: error C2143: syntax error : missing ';' before 'namespace'. Ошибка отправляет в файл yvals.h, где
C++
1
2
3
4
5
6
7
8
9
#endif /* __cplusplus */
 
 #define _Restrict  restrict
 
 #ifdef __cplusplus
_STD_BEGIN (сюда)
typedef bool _Bool;
_STD_END
 #endif /* __cplusplus */
Мой же код совершенно прост.
C++
1
2
3
4
5
6
7
8
9
10
11
12
13
#include "stdafx.h"
#include "func.h"
#include <iostream>
 
using namespace std;
int a,b;
 
int main(int argc, _TCHAR* argv[])
{
    cin>>a>>b;
    cout<<func(a,b);
    return 0;
}
На форуме находил тему с подобной ошибкой, но так и не смог исправиться.
0
Надоела реклама? Зарегистрируйтесь и она исчезнет полностью.
Similar
Эксперт
41792 / 34177 / 6122
Регистрация: 12.04.2006
Сообщений: 57,940
22.04.2014, 20:31
Здравствуйте! Я подобрал для вас темы с ответами на вопрос Ошибка в yvals.h - Syntax error:missing ';' before 'namespace' (C++):

Ошибка error C2146: syntax error : missing ';' before identifier 'alph' - C++
Не получается откомпилировать прогу из консоля в MFC, выбивает ошибку error C2146: syntax error : missing ';' before identifier 'alph' ...

Ошибка кода Syntax error: missing ')' before ';' - C++
В чем ошибка данного кода double b; double c; double m; double a=(2+sin(2.0)/(sin(5.0)+5); cout&lt;&lt;a&lt;&lt;endl;

Ошибка в тестовом примере: "Error 1 error C2143: syntax error : missing ';' before 'if'" - C++
#include&lt;iostream&gt; using namespace std; int main(){ int x, a = 0, b = 10; (cin &gt;&gt; x).get(); while (x){ int c = x % 10; ...

Syntax error : missing ')' before ';' - C++
пишу программу подсчета значения функции, вроде уже везде где надо поставила скобочки, ковычки и завершающие ; пишет ошибку syntax error...

Error C2143: syntax error : missing ';' before '.' - C++
#include &lt;fstream&gt; #include &lt;iostream&gt; using std::cin; using std::cout; using std::endl; using std::ifstream; using...

vc++2008 ошибка cmath(21) : error C2039: 'acosf' : is not a member of '`global namespace'' - C++
Использую math.h При компиляции выдает : cmath(21) : error C2039: 'acosf' : is not a member of '`global namespace'' 1&gt;D:\Microsoft...

4
0x10
2482 / 1657 / 249
Регистрация: 24.11.2012
Сообщений: 4,126
22.04.2014, 20:50 #2
Возможно, в func.h пропущена точка с запятой или присутствует другая ошибка.
1
AndBo
0 / 0 / 0
Регистрация: 18.04.2014
Сообщений: 3
22.04.2014, 21:01  [ТС] #3
Действительно. Но всё же, почему же он ругается на namespace, а не на ошибку....
0
0x10
2482 / 1657 / 249
Регистрация: 24.11.2012
Сообщений: 4,126
23.04.2014, 04:52 #4
Цитата Сообщение от AndBo Посмотреть сообщение
missing ';' before 'namespace'.
Переводим до полного просветления.
0
zss
Модератор
Эксперт С++
6575 / 6137 / 2021
Регистрация: 18.12.2011
Сообщений: 15,993
Завершенные тесты: 1
23.04.2014, 06:46 #5
Цитата Сообщение от AndBo Посмотреть сообщение
#include "func.h"
поставьте перед main.
Скорее всего в нем и ошибка.
0
23.04.2014, 06:46
MoreAnswers
Эксперт
37091 / 29110 / 5898
Регистрация: 17.06.2006
Сообщений: 43,301
23.04.2014, 06:46
Привет! Вот еще темы с ответами:

Ошибка syntax error before `(' token - C++
Помогите плз. Нужно 3 прoги на 1 условие используя For, While(), Do...While. Сумма 1/sin(1) + 1/(sin(1) + sin(2)) + … +...

ошибка declaration syntax error - C++
Добрый вечер! помогите пожалуйста разобраться в коде - написал подпрограмму по анимации символов,//gorovenko taras #include &lt;conio.h&gt; ...

Ошибка [C++ Error] Unit1.cpp(5): E2139 Declaration missing ; - C++
Ошибка Unit1.cpp(5): E2139 Declaration missing ; Падает на строчку: int main () Исходник : ...

Выдается ошибка при компиляции (error C2447: missing function header (old-style formal list?)) - C++
не работает программа, выдает ошибку C:\Program Files\Microsoft Visual Studio\MyProjects\564356765456\cfvb n.cpp(6) : error C2447:...


Искать еще темы с ответами

Или воспользуйтесь поиском по форуму:
5
Ответ Создать тему
Опции темы

КиберФорум - форум программистов, компьютерный форум, программирование
Powered by vBulletin® Version 3.8.9
Copyright ©2000 - 2017, vBulletin Solutions, Inc.