Форум программистов, компьютерный форум CyberForum.ru
Наши страницы

С++ для начинающих

Войти
Регистрация
Восстановить пароль
 
nocl1p
37 / 22 / 10
Регистрация: 30.03.2012
Сообщений: 300
#1

При компиляции кода вылазит ошибка "error C2027: use of undefined type 'SldWorks'" - C++

13.06.2014, 19:31. Просмотров 930. Ответов 1
Метки нет (Все метки)

При компиляции кода вылазит ошибка "error C2027: use of undefined type 'SldWorks'".
Я писал на чистых плюсах!

C++
1
2
3
4
5
6
7
8
9
10
11
12
13
14
15
16
17
18
19
20
21
22
23
24
25
26
27
28
29
30
31
32
33
34
35
36
37
38
39
40
41
42
43
44
45
46
47
48
49
50
51
52
53
54
55
56
57
58
59
60
61
62
63
64
65
66
67
68
69
70
71
72
73
74
75
76
77
78
79
80
81
82
83
84
85
#include "stdafx.h"
#include <atlbase.h>
#include <windows.h>
#include <iostream>
 
#import "sldworks.tlb" raw_interfaces_only, raw_native_types, no_namespace, named_guids, rename("PropertySheet", "ShowPropertySheet"),rename("GetOpenFileName", "SWGetOpenFileName")
#import "swconst.tlb" raw_interfaces_only, raw_native_types, no_namespace, named_guids
 
using namespace std;
using namespace ATL;
 
int _tmain(int argc, _TCHAR* argv[])
{
 
//Initialize COM
CoInitialize(NULL);
 
CLSID clsid;
::CLSIDFromProgID(L"SldWorks.Application", &clsid); 
 
CComPtr<SldWorks::ISldWorks> swApp = NULL;
 
//Create an instance of SolidWorks
HRESULT hres = CoCreateInstance(clsid, NULL, CLSCTX_LOCAL_SERVER, __uuidof(SldWorks::ISldWorks), (void**)&swApp);
 
VARIANT_BOOL Retval;
 
if (hres == S_OK)
{
    swApp->put_Visible(true);
    swApp->put_UserControl(false);
    
    CComBSTR sFileName(L"C:\\Users\\noclip\\Desktop\\Сборка1.SLDASM");
    CComBSTR sDefaultConfiguration(L"Default");
 
    long fileerror, filewarning;
    SldWorks::IModelDoc2 *swModel, *swModel2 = NULL;
    SldWorks::IDocumentSpecification *swSpec = NULL;
    IDispatch *swDisp = NULL;
 
    hres = swApp->OpenDoc6(sFileName,SwConst::swDocASSEMBLY,swOpenDocOptions_Silent,sDefaultConfiguration,&fileerror,&filewarning,&swModel);
 
    swApp->IActivateDoc3(sFileName,true,&fileerror,&swModel);
    swApp->get_IActiveDoc2(&swModel);
    hres = swModel->EditRebuild3(&Retval);
 
    SldWorks::ICallout *swCall = NULL;
 
    SldWorks::IModelDocExtension *swModExt = NULL;
    hres = swModel->get_Extension(&swModExt);
    hres = swModExt->SelectByID2(L"Equations",L"EQNFOLDER",0,0,0,false,0,swCall,0,&Retval);
 
    hres = swModel->ClearSelection2(true);
 
    long eqscount, retval2;
    SldWorks::IEquationMgr *swEqnMgr = NULL;
    hres = swModel->GetEquationMgr(&swEqnMgr);
    hres = swEqnMgr->EvaluateAll(&retval2);
 
    cout << "Press ENTER to start...\n"; cin.get();
 
 
    hres = swEqnMgr->GetCount(&eqscount);
    CComBSTR eqn[10];
    for (int i=0;i<eqscount;i++) {
        cout << "Equation Nr." << i+1 << ": Retrieving...";
        hres = swEqnMgr->get_Equation(long(i),&eqn[i]);
        if (hres==S_OK) cout << "OK; Text: " << static_cast < char* > (_bstr_t(eqn[i], FALSE)) << "\n"; 
        else cout << "Error!!!\n"; }
 
        eqn[0]=L"\"d1\"=20"; eqn[1]=L"\"d2\"=10";
    hres = swEqnMgr->Delete(0,&retval2);
    hres = swEqnMgr->Add2(0,eqn[0],false,&retval2);
    hres = swEqnMgr->Delete(1,&retval2);
    hres = swEqnMgr->Add2(1,eqn[1],false,&retval2);
        hres = swApp->CloseAllDocuments(true, &Retval);
        swApp->ExitApp();
 
       // Release COM reference
       swApp = NULL;
 
       //Uninitialize COM
       CoUninitialize();
        return 0;
        }
0
Similar
Эксперт
41792 / 34177 / 6122
Регистрация: 12.04.2006
Сообщений: 57,940
13.06.2014, 19:31
Здравствуйте! Я подобрал для вас темы с ответами на вопрос При компиляции кода вылазит ошибка "error C2027: use of undefined type 'SldWorks'" (C++):

Ошибка при компиляции In function"int main()"; expected ';', before "cin", [Build Error] [main.o] Error 1 - C++
Книга &quot;Основы программирования на C++ том 1&quot;(Стэнли Б.Липпман). Приводится пример кода. #include &lt;iostream&gt; #include &lt;string&gt; using...

Ошибка при компиляции "Size of the type 'char[]' is unknown or zero" - C++
При компиляции, появляется ошибка: Unit1.cpp(15): E2453 Size of the type 'char' is unknown or zero Помогите исправить. Вот текст...

[Решено] Ошибка: "Undefined symbol _main in module c0.ASM" при компиляции в пакетном режиме - C++
Доброго времени суток всем! При компиляции в пакетном режиме выходила следующая ошибка: Undefined symbol _main in module c0.ASM Но...

Ошибка "error C4430: missing type specifier" при работе с fstream - C++
Добрый день. Работаю над сохранением и загрузкой файлов. Для этого использую библиотеку &lt;fstream&gt;, создаю обьект класса fstream. А...

Ошибка при компиляции "error C2088: <<: недопустимо для class" - C++
Доброго времени суток :) у меня при компиляции возникает ошибка 1&gt;main.cpp(493): error C2088: &lt;&lt;: недопустимо для class суть в том...

Ошибка линковки файлов при компиляции: "fatal error LNK1169: обнаружен многократно определенный символ" - C++
Visual C++ 2008 Express Edition ошибка Компиляция... 1.cpp Компоновка... 2.obj : error LNK2005: &quot;int __cdecl GetByte(int)&quot;...

Надоела реклама? Зарегистрируйтесь и она исчезнет полностью.
nocl1p
37 / 22 / 10
Регистрация: 30.03.2012
Сообщений: 300
16.06.2014, 18:46  [ТС] #2
Я в принципе уже разобрался. Спасибо.
0
MoreAnswers
Эксперт
37091 / 29110 / 5898
Регистрация: 17.06.2006
Сообщений: 43,301
16.06.2014, 18:46
Привет! Вот еще темы с ответами:

При компиляции ошибка: C2228: left of ".real",".imag" must have struct/class/union - C++
Помогите, пожалуйста! Компилирую в VS2010... Ошибка: C2228: left of &quot;.real&quot;,&quot;.imag&quot; must have struct/class/union... Почему возникает эта...

Ошибка: argument of type "char *" is incompatible with parameter of type "LPCWSTR" - C++
Помогите, пожалуйста, исправить ошибку в программе. #include &lt;iostream&gt; #include &quot;stdio.h&quot; #include &quot;windows.h&quot; #include &lt;conio.h&gt; ...

Ошибка компиляции: error C2562: main: функция типа "void" - C++
Возникла проблема, при компиляции выдает ошибку &quot;1&gt;c:\users\user\documents\visual studio 2012\projects\lab1\lab1\lab1.cpp(30): error C2562:...

Code::Blocks ошибка компиляции "fatal error iostream no such file or directory" - C++
Всем привет ! Я очень давно хотел научиться программировать и вот решил начать . Сначала посоветовали программу Dev C++ , но потом я...


Искать еще темы с ответами

Или воспользуйтесь поиском по форуму:
Ответ Создать тему
Опции темы

КиберФорум - форум программистов, компьютерный форум, программирование
Powered by vBulletin® Version 3.8.9
Copyright ©2000 - 2017, vBulletin Solutions, Inc.
Рейтинг@Mail.ru