Форум программистов, компьютерный форум CyberForum.ru

С++ для начинающих

Войти
Регистрация
Восстановить пароль
 
Рейтинг: Рейтинг темы: голосов - 15, средняя оценка - 4.80
esenbek
0 / 1 / 0
Регистрация: 13.05.2013
Сообщений: 316
#1

Error MSB6006: "cmd.exe" exited with code 3 - C++

09.07.2015, 10:16. Просмотров 2474. Ответов 3
Метки нет (Все метки)

Переустановил Виндовс после компиляции сервера.
выдает такую ошибку ,помогите пожалуйста как исправить
C++
1
2
3
4
5
6
7
8
9
10
11
12
13
14
15
16
17
18
19
20
21
22
23
24
25
26
27
28
29
30
31
32
33
34
35
36
37
38
39
40
41
42
43
44
45
46
47
48
49
50
51
52
53
54
55
56
57
58
59
60
61
62
63
64
65
66
67
68
69
70
71
72
73
74
75
76
77
78
79
80
81
82
83
84
85
86
87
88
89
90
91
92
93
94
95
96
97
1>------ Rebuild All started: Project: ZERO_CHECK, Configuration: Release Win32 ------
1>  Checking Build System
1>  Системе не удается найти указанный путь.
1>C:\Program Files\MSBuild\Microsoft.Cpp\v4.0\Microsoft.CppCommon.targets(151,5): error MSB6006: "cmd.exe" exited with code 3.
2>------ Rebuild All started: Project: tinycdb, Configuration: Release Win32 ------
3>------ Rebuild All started: Project: win32, Configuration: Release Win32 ------
2>  Building Custom Rule F:/Ghost ++/PVPGN-SERVER/src/tinycdb/CMakeLists.txt
2>  Системе не удается найти указанный путь.
2>C:\Program Files\MSBuild\Microsoft.Cpp\v4.0\Microsoft.CppCommon.targets(151,5): error MSB6006: "cmd.exe" exited with code 3.
4>------ Rebuild All started: Project: common, Configuration: Release Win32 ------
3>  Building Custom Rule F:/Ghost ++/PVPGN-SERVER/src/win32/CMakeLists.txt
3>  Системе не удается найти указанный путь.
3>C:\Program Files\MSBuild\Microsoft.Cpp\v4.0\Microsoft.CppCommon.targets(151,5): error MSB6006: "cmd.exe" exited with code 3.
4>  Building Custom Rule F:/Ghost ++/PVPGN-SERVER/src/common/CMakeLists.txt
4>  Системе не удается найти указанный путь.
4>C:\Program Files\MSBuild\Microsoft.Cpp\v4.0\Microsoft.CppCommon.targets(151,5): error MSB6006: "cmd.exe" exited with code 3.
5>------ Rebuild All started: Project: compat, Configuration: Release Win32 ------
5>  Building Custom Rule F:/Ghost ++/PVPGN-SERVER/src/compat/CMakeLists.txt
5>  Системе не удается найти указанный путь.
5>C:\Program Files\MSBuild\Microsoft.Cpp\v4.0\Microsoft.CppCommon.targets(151,5): error MSB6006: "cmd.exe" exited with code 3.
6>------ Rebuild All started: Project: bni2tga, Configuration: Release Win32 ------
6>  Building Custom Rule F:/Ghost ++/PVPGN-SERVER/src/bniutils/CMakeLists.txt
6>  Системе не удается найти указанный путь.
6>C:\Program Files\MSBuild\Microsoft.Cpp\v4.0\Microsoft.CppCommon.targets(151,5): error MSB6006: "cmd.exe" exited with code 3.
7>------ Rebuild All started: Project: d2cs, Configuration: Release Win32 ------
8>------ Rebuild All started: Project: d2dbs, Configuration: Release Win32 ------
7>  Building Custom Rule F:/Ghost ++/PVPGN-SERVER/src/d2cs/CMakeLists.txt
7>  Системе не удается найти указанный путь.
8>  Building Custom Rule F:/Ghost ++/PVPGN-SERVER/src/d2dbs/CMakeLists.txt
8>  Системе не удается найти указанный путь.
8>C:\Program Files\MSBuild\Microsoft.Cpp\v4.0\Microsoft.CppCommon.targets(151,5): error MSB6006: "cmd.exe" exited with code 3.
7>C:\Program Files\MSBuild\Microsoft.Cpp\v4.0\Microsoft.CppCommon.targets(151,5): error MSB6006: "cmd.exe" exited with code 3.
9>------ Rebuild All started: Project: sha1hash, Configuration: Release Win32 ------
9>  Building Custom Rule F:/Ghost ++/PVPGN-SERVER/src/bnpass/CMakeLists.txt
9>  Системе не удается найти указанный путь.
9>C:\Program Files\MSBuild\Microsoft.Cpp\v4.0\Microsoft.CppCommon.targets(151,5): error MSB6006: "cmd.exe" exited with code 3.
10>------ Rebuild All started: Project: bntrackd, Configuration: Release Win32 ------
11>------ Rebuild All started: Project: bnstat, Configuration: Release Win32 ------
10>  Building Custom Rule F:/Ghost ++/PVPGN-SERVER/src/bntrackd/CMakeLists.txt
10>  Системе не удается найти указанный путь.
10>C:\Program Files\MSBuild\Microsoft.Cpp\v4.0\Microsoft.CppCommon.targets(151,5): error MSB6006: "cmd.exe" exited with code 3.
11>  Building Custom Rule F:/Ghost ++/PVPGN-SERVER/src/client/CMakeLists.txt
11>  Системе не удается найти указанный путь.
11>C:\Program Files\MSBuild\Microsoft.Cpp\v4.0\Microsoft.CppCommon.targets(151,5): error MSB6006: "cmd.exe" exited with code 3.
12>------ Rebuild All started: Project: bnpass, Configuration: Release Win32 ------
12>  Building Custom Rule F:/Ghost ++/PVPGN-SERVER/src/bnpass/CMakeLists.txt
12>  Системе не удается найти указанный путь.
12>C:\Program Files\MSBuild\Microsoft.Cpp\v4.0\Microsoft.CppCommon.targets(151,5): error MSB6006: "cmd.exe" exited with code 3.
13>------ Rebuild All started: Project: tgainfo, Configuration: Release Win32 ------
14>------ Rebuild All started: Project: bniextract, Configuration: Release Win32 ------
13>  Building Custom Rule F:/Ghost ++/PVPGN-SERVER/src/bniutils/CMakeLists.txt
13>  Системе не удается найти указанный путь.
13>C:\Program Files\MSBuild\Microsoft.Cpp\v4.0\Microsoft.CppCommon.targets(151,5): error MSB6006: "cmd.exe" exited with code 3.
15>------ Rebuild All started: Project: bnibuild, Configuration: Release Win32 ------
14>  Building Custom Rule F:/Ghost ++/PVPGN-SERVER/src/bniutils/CMakeLists.txt
14>  Системе не удается найти указанный путь.
14>C:\Program Files\MSBuild\Microsoft.Cpp\v4.0\Microsoft.CppCommon.targets(151,5): error MSB6006: "cmd.exe" exited with code 3.
15>  Building Custom Rule F:/Ghost ++/PVPGN-SERVER/src/bniutils/CMakeLists.txt
15>  Системе не удается найти указанный путь.
15>C:\Program Files\MSBuild\Microsoft.Cpp\v4.0\Microsoft.CppCommon.targets(151,5): error MSB6006: "cmd.exe" exited with code 3.
16>------ Rebuild All started: Project: bnftp, Configuration: Release Win32 ------
16>  Building Custom Rule F:/Ghost ++/PVPGN-SERVER/src/client/CMakeLists.txt
16>  Системе не удается найти указанный путь.
16>C:\Program Files\MSBuild\Microsoft.Cpp\v4.0\Microsoft.CppCommon.targets(151,5): error MSB6006: "cmd.exe" exited with code 3.
17>------ Rebuild All started: Project: bnetsrp3_test, Configuration: Release Win32 ------
17>  Building Custom Rule F:/Ghost ++/PVPGN-SERVER/src/test/CMakeLists.txt
17>  Системе не удается найти указанный путь.
17>C:\Program Files\MSBuild\Microsoft.Cpp\v4.0\Microsoft.CppCommon.targets(151,5): error MSB6006: "cmd.exe" exited with code 3.
18>------ Rebuild All started: Project: bnetd, Configuration: Release Win32 ------
19>------ Rebuild All started: Project: bnchat, Configuration: Release Win32 ------
19>  Building Custom Rule F:/Ghost ++/PVPGN-SERVER/src/client/CMakeLists.txt
19>  Системе не удается найти указанный путь.
19>C:\Program Files\MSBuild\Microsoft.Cpp\v4.0\Microsoft.CppCommon.targets(151,5): error MSB6006: "cmd.exe" exited with code 3.
18>  Building Custom Rule F:/Ghost ++/PVPGN-SERVER/src/bnetd/CMakeLists.txt
18>  Системе не удается найти указанный путь.
18>C:\Program Files\MSBuild\Microsoft.Cpp\v4.0\Microsoft.CppCommon.targets(151,5): error MSB6006: "cmd.exe" exited with code 3.
20>------ Rebuild All started: Project: bncdb, Configuration: Release Win32 ------
20>  Building Custom Rule F:/Ghost ++/PVPGN-SERVER/src/tinycdb/CMakeLists.txt
20>  Системе не удается найти указанный путь.
20>C:\Program Files\MSBuild\Microsoft.Cpp\v4.0\Microsoft.CppCommon.targets(151,5): error MSB6006: "cmd.exe" exited with code 3.
21>------ Rebuild All started: Project: bnbot, Configuration: Release Win32 ------
21>  Building Custom Rule F:/Ghost ++/PVPGN-SERVER/src/client/CMakeLists.txt
21>  Системе не удается найти указанный путь.
21>C:\Program Files\MSBuild\Microsoft.Cpp\v4.0\Microsoft.CppCommon.targets(151,5): error MSB6006: "cmd.exe" exited with code 3.
22>------ Rebuild All started: Project: bigint, Configuration: Release Win32 ------
22>  Building Custom Rule F:/Ghost ++/PVPGN-SERVER/src/test/CMakeLists.txt
22>  Системе не удается найти указанный путь.
22>C:\Program Files\MSBuild\Microsoft.Cpp\v4.0\Microsoft.CppCommon.targets(151,5): error MSB6006: "cmd.exe" exited with code 3.
23>------ Rebuild All started: Project: bnilist, Configuration: Release Win32 ------
23>  Building Custom Rule F:/Ghost ++/PVPGN-SERVER/src/bniutils/CMakeLists.txt
23>  Системе не удается найти указанный путь.
23>C:\Program Files\MSBuild\Microsoft.Cpp\v4.0\Microsoft.CppCommon.targets(151,5): error MSB6006: "cmd.exe" exited with code 3.
24>------ Rebuild All started: Project: ALL_BUILD, Configuration: Release Win32 ------
24>  Building Custom Rule F:/Ghost ++/PVPGN-SERVER/CMakeLists.txt
24>  Системе не удается найти указанный путь.
24>C:\Program Files\MSBuild\Microsoft.Cpp\v4.0\Microsoft.CppCommon.targets(151,5): error MSB6006: "cmd.exe" exited with code 3.
========== Rebuild All: 0 succeeded, 24 failed, 0 skipped ==========
Similar
Эксперт
41792 / 34177 / 6122
Регистрация: 12.04.2006
Сообщений: 57,940
09.07.2015, 10:16     Error MSB6006: "cmd.exe" exited with code 3
Посмотрите здесь:

Error NSB6006 "cmd.exe" завершилась с кодом 1 - C++
Приветствую! Программа собирается и даже запускается, но перед запуском сообщается об ошибке и Visual Studio предлагает запустить...

Ошибка The thread 0x390 has exited with code 0 (0x0). The program 'D:AlexVVCPr1DebugPr1.exe' has exited with code 0 (0x0). - C++
Loaded 'D:WINNTSystem32 tdll.dll', no matching symbolic information found. Loaded 'D:WINNTsystem32kernel32.dll', no matching symbolic...

Code::Bloks C++, В чем разница "codeblocks-12.11-setup.exe" и "codeblocks-12.11mingw-setup.exe" - C++
Захожу на сайт хочу скачать codeblocks чтобы на нем изучать си++ , толька н могу понять разницы там для виндовс есть четыре файла вот они ...

Code::Blocks ошибка компиляции "fatal error iostream no such file or directory" - C++
Всем привет ! Я очень давно хотел научиться программировать и вот решил начать . Сначала посоветовали программу Dev C++ , но потом я...

Visual Studio 2012 Ошибка 1 error : Required file "tracker.exe" is missing. - C++
vs 2012 #include "stdafx.h" #include <iostream> using namespace std; int main() { cout<<"123"<<endl; return...

Ошибки "Expression syntax" и "Unreachable code" при реализации класса матриц - C++
Подскажите по коду. #include <iostream.h> #include <math.h> #include <string.h> #include <stdio.h> #include <windows.h> ...

После регистрации реклама в сообщениях будет скрыта и будут доступны все возможности форума.
egor2116
09.07.2015, 11:29
  #2

Не по теме:

Переустановил Виндовс после компиляции сервера.
мать моя в кедах

tnk500
113 / 117 / 25
Регистрация: 25.08.2012
Сообщений: 1,269
Завершенные тесты: 3
09.07.2015, 11:30     Error MSB6006: "cmd.exe" exited with code 3 #3
esenbek, это может означать только то, что либо путей таких не существует вообще (что вполне вероятно), либо компилятор их не видит. Проверяйте пути
MoreAnswers
Эксперт
37091 / 29110 / 5898
Регистрация: 17.06.2006
Сообщений: 43,301
11.04.2016, 09:17     Error MSB6006: "cmd.exe" exited with code 3
Еще ссылки по теме:

Необработанное исключение в "0x776315de" в "c++1.exe": 0xC0000005: Нарушение прав доступа при записи "0x40e000 - C++
Здравствуйте. Только начал работать с динамическим массивом, но не могу понять почему появляется эта ошибка. Работаю с библиотекой sfml....

Необработанное исключение в "0x104b2288" в "Matrix.exe": 0xC0000005: Нарушение прав доступа при записи "0xcdcd - C++
Вот такая ошибка!

Необработанное исключение в "0x0138169d" в "kursovaya.exe": 0xC0000005: Нарушение прав доступа при чтении "0x6 - C++
Программа выдает ошибку, может кто видит где? и как исправить Код: #include <iostream> #include <ctime> #include <cmath> using...

Ошибка при компиляции In function"int main()"; expected ';', before "cin", [Build Error] [main.o] Error 1 - C++
Книга "Основы программирования на C++ том 1"(Стэнли Б.Липпман). Приводится пример кода. #include <iostream> #include <string> using...

Ошибка "error C2446: :: нет преобразования "int" в "char *" - C++
Ошибка: "error C2446: :: нет преобразования "int" в "char *" Когда нажимаю двойным кликом на ошибку меня перекидывает в файл...

Помогите пожалуйста "error C2143:" и "error C4430:" - C++
Здравствуйте. помогите пожалуйста понять как правильно сделать оъявление вот такой штуки... class bst{ struct et{ et* l; ...


Искать еще темы с ответами

Или воспользуйтесь поиском по форуму:
Delari
1 / 1 / 0
Регистрация: 28.06.2015
Сообщений: 28
11.04.2016, 09:17     Error MSB6006: "cmd.exe" exited with code 3 #4
А можно поточнее? где и что прописывать?
Yandex
Объявления
11.04.2016, 09:17     Error MSB6006: "cmd.exe" exited with code 3
Ответ Создать тему
Опции темы

КиберФорум - форум программистов, компьютерный форум, программирование
Powered by vBulletin® Version 3.8.9
Copyright ©2000 - 2017, vBulletin Solutions, Inc.
Рейтинг@Mail.ru