Форум программистов, компьютерный форум CyberForum.ru

С++ для начинающих

Войти
Регистрация
Восстановить пароль
 
Klotilda
0 / 0 / 0
Регистрация: 09.04.2012
Сообщений: 100
#1

Ошибки при Solutions Configuration->Release - C++

14.07.2015, 15:23. Просмотров 649. Ответов 3
Метки нет (Все метки)

Здравствуйте! Я пишу программу на С++ Win APi. Если поставить Solutions Configuration->Debug, программа работает нормально, то если поменять на Solutions Configuration->Release, появляется 25 ошибок такого типа

error C2664: 'CreateFileW' : cannot convert parameter 1 from 'const char [17]' to 'LPCWSTR'
1> Types pointed to are unrelated; conversion requires reinterpret_cast, C-style cast or function-style cast
1>.\Settings.cpp(17) : error C2664: 'MessageBoxW' : cannot convert parameter 2 from 'const char [17]' to 'LPCWSTR'
1> Types pointed to are unrelated; conversion requires reinterpret_cast, C-style cast or function-style cast
1>.\Settings.cpp(52) : error C2664: 'CreateFileW' : cannot convert parameter 1 from 'const char [17]' to 'LPCWSTR'
1>
1>.\main.cpp(134) : error C2664: 'CreateFileW' : cannot convert parameter 1 from 'const char [13]' to 'LPCWSTR'
1> Types pointed to are unrelated; conversion requires reinterpret_cast, C-style cast or function-style cast
1>.\main.cpp(139) : error C2664: 'MessageBoxW' : cannot convert parameter 2 from 'const char [17]' to 'LPCWSTR'
1> Types pointed to are unrelated; conversion requires reinterpret_cast, C-style cast or function-style cast
1>.\main.cpp(148) : error C2664: 'MessageBoxW' : cannot convert parameter 2 from 'const char [17]' to 'LPCWSTR'
1>
1>.\m
1> Types pointed to are unrelated; conversion requires reinterpret_cast, C-style cast or function-style cast
1>.\main.cpp(603) : error C2664: 'MessageBoxW' : cannot convert parameter 2 from 'const char [29]' to 'LPCWSTR'
1> Types pointed to are unrelated; conversion requires reinterpret_cast, C-style cast or function-style cast

Очень прошу совета, из-за чего это получилось и как это исправить
Similar
Эксперт
41792 / 34177 / 6122
Регистрация: 12.04.2006
Сообщений: 57,940
14.07.2015, 15:23     Ошибки при Solutions Configuration->Release
Посмотрите здесь:

При компиляции под Release вылезают ошибки - C++
Использую sfml. Под Debug компилирует нормально, а когда переключаю на Release, появляется 51 ошибка... Error 64 error LNK1120: 50...

При запуске прогаммы из папки Release вылетает - C++
Есть программа написанная мной(500 строк) Если запускаю дебаг, все работает так как надо Если запускаю реалайз, все работает как надо ...

Ошибка при построении Release в VC 2010 Express. - C++
Использую qt-win-opensource-4.8.1-vs2010 с VC 2010 Express. Проект разделён на три файла: mainwindow.h #include <QtGui> #include...

Проблемы с кодировкой при переключении из Debug в Release в MSVS 2010 - C++
Собираю проект в режиме дебаг все символы норм отображаются,переключаю на релиз и одни кракозябры, в чем может быть дело ?

VC++6.0/ATL - ошибка сборки в режиме Release при исп.функций из math.h - C++
В проекте созданным ATL COM AppWizard обязательно без поддержки MFC при использовании функций, объявленных в math.h, например, sqrt(),...

Как в Visual Studio задать имя файла при запуске Release через Ctrl + F5? - C++
Я переименовал выходной файл в режиме Release в свойствах Linker->General->Output, но при попытки из студии как обычно запустить...

После регистрации реклама в сообщениях будет скрыта и будут доступны все возможности форума.
SatanaXIII
Супер-модератор
Эксперт С++
5607 / 2641 / 242
Регистрация: 01.11.2011
Сообщений: 6,499
Завершенные тесты: 1
14.07.2015, 15:47     Ошибки при Solutions Configuration->Release #2
Цитата Сообщение от Klotilda Посмотреть сообщение
Если поставить Solutions Configuration->Debug
Что за среда программирования? Visual Studio?

Цитата Сообщение от Klotilda Посмотреть сообщение
из-за чего это получилось и как это исправить
Это получилось из-за того, что данные функции принимают юникодные строки, а вы подсовываете обычные.
В настройках проекта где-то нужно выбрать как интерпретировать строки по умолчанию.
Klotilda
0 / 0 / 0
Регистрация: 09.04.2012
Сообщений: 100
14.07.2015, 16:42  [ТС]     Ошибки при Solutions Configuration->Release #3
Среда разработки Visual Studio 2008. В настройках проекта Use Multi-byte character set.Подскажите, пожалуйста, как это исправить
MoreAnswers
Эксперт
37091 / 29110 / 5898
Регистрация: 17.06.2006
Сообщений: 43,301
14.07.2015, 17:05     Ошибки при Solutions Configuration->Release
Еще ссылки по теме:

Solutions manual по книге c++ how to programm - C++
Апну темку и заодно мб, кто-нибудь имеет еще 1 книжку. Нужен solutions manual по книге c++ how to programm (5 издания). Заранее спс.

Release - C++
Доброго времени суток всем! Есть такая проблема, создал свой первый калькулятор, проект windows forms(мое первое знакомство с формами:)) и...

ошибки при компилировании - C++
/* organizations.cpp */ #include <string> #include <fstream> #include "organizations.h" //destructor ...

Ошибки при компиляции - C++
весь текст программы, и его компилятор перестал выполнять #include <iostream.h> int main () { system("pause"); } По ошибкам: ...

Ошибки при реализации - C++
4) Объявить массив из 3 указателей на вещественные переменные, переменные разместить в: a) статической памяти, b) динамической памяти....

Ошибки при компиляции - C++
Вот такие ошибки у меня выдает при компиляции: error: stray ‘\320’ in program error: stray ‘\260’ in program Что это может быть?


Искать еще темы с ответами

Или воспользуйтесь поиском по форуму:
EugeneQ
1 / 1 / 0
Регистрация: 20.06.2014
Сообщений: 47
14.07.2015, 17:05     Ошибки при Solutions Configuration->Release #4
Цитата Сообщение от Klotilda Посмотреть сообщение
появляется 25 ошибок такого типа
создать TCHAR name[] = _T("...");
CreateFile(name,......);
Yandex
Объявления
14.07.2015, 17:05     Ошибки при Solutions Configuration->Release
Ответ Создать тему
Опции темы

КиберФорум - форум программистов, компьютерный форум, программирование
Powered by vBulletin® Version 3.8.9
Copyright ©2000 - 2017, vBulletin Solutions, Inc.
Рейтинг@Mail.ru