Форум программистов, компьютерный форум CyberForum.ru

С++ для начинающих

Войти
Регистрация
Восстановить пароль
 
Рейтинг: Рейтинг темы: голосов - 13, средняя оценка - 4.77
ELDQS
10 / 10 / 1
Регистрация: 07.04.2011
Сообщений: 561
Записей в блоге: 1
#1

ошибка в коде - C++

17.04.2011, 06:07. Просмотров 2076. Ответов 11
Метки нет (Все метки)

C++
1
2
3
4
5
6
7
8
9
10
11
12
13
14
15
16
17
18
19
// WhileDemo — введите счетчик цикла.
// Программа выводит количество выполненных
// циклов while
#include: <stdio.h>
# include: < lost ream. h>
int main(int arg, char* pszArgs[])
(
           // ввод счетчика цикла
           int loopCount;
           cout << "Введите loopCount: ";
          cin >> loopCount;
          // теперь в цикле ЕЫВОДИМ значения
           while (loopCount > 0)
(
loopCount = loopCount — 1;
сout << "Осталось выполнить "
<< loopCount << " циклов\п";
}
return 0;
Similar
Эксперт
41792 / 34177 / 6122
Регистрация: 12.04.2006
Сообщений: 57,940
17.04.2011, 06:07     ошибка в коде
Посмотрите здесь:

ошибка в коде. - C++
вечер добрый. помогите найти ошибку. #include &lt;iostream&gt; template &lt;class T&gt; class stack { private: const static unsigned...

Ошибка в коде - C++
#include &lt;stdio.h&gt; #include &quot;stdafx.h&quot; #include &lt;conio.h&gt; #include &lt;iostream&gt; using std::ostream; using std::cout; using...

Ошибка в коде - C++
Кто знает в чём дело? Скинули файл. Код без ошибок, а компиляторы ругаются. #include &quot;stdafx.h&quot; #include &lt;iostream&gt; #include...

Ошибка в коде C++ - C++
Надо присвоить все данные значения в result используя цикл в цикле у меня получается значение на много больше чем должно быть что не так? ...

Ошибка в коде - C++
Не могу исправить ошибку в 12 и 13 строке, прошу помочь. //programma podbora parol9 #include &lt;iostream&gt; using std::cout; using...

Ошибка в коде - C++
Подскажите пожалуйста, почему не работает. Выдает ошибку: error LNK2019: ссылка на неразрешенный внешний символ &quot;public: void __thiscall...

Ошибка в коде - C++
Задача: Получить максимальную по длине неубывающую под последовательность цифр введенного числа. Ошибка возникает в случае если эта под...

После регистрации реклама в сообщениях будет скрыта и будут доступны все возможности форума.
ValeryS
Модератор
6550 / 5016 / 463
Регистрация: 14.02.2011
Сообщений: 16,729
17.04.2011, 06:37     ошибка в коде #2
Цитата Сообщение от ELDQS Посмотреть сообщение
# include: < lost ream. h>
??????
ELDQS
10 / 10 / 1
Регистрация: 07.04.2011
Сообщений: 561
Записей в блоге: 1
17.04.2011, 06:40  [ТС]     ошибка в коде #3
где ошибка
ValeryS
Модератор
6550 / 5016 / 463
Регистрация: 14.02.2011
Сообщений: 16,729
17.04.2011, 06:44     ошибка в коде #4
Цитата Сообщение от ELDQS Посмотреть сообщение
# include: < lost ream. h>
Это что тут написано???
где ошибка
у тебя надо спросить? что пишет компилятор?
для оформления кода в посте есть специальные теги
ELDQS
10 / 10 / 1
Регистрация: 07.04.2011
Сообщений: 561
Записей в блоге: 1
17.04.2011, 07:16  [ТС]     ошибка в коде #5
C++
1
2
3
4
5
6
7
8
9
10
11
12
13
14
15
16
17
18
19
// WhileDemo — введите счетчик цикла.
// Программа выводит количество выполненных
// циклов while
#include: <stdio.h>
# include: < lostream. h>
int main(int arg, char* pszArgs[])
(
           // ввод счетчика цикла
           int loopCount;
           cout << "Введите loopCount: ";
          cin >> loopCount;
          // теперь в цикле ЕЫВОДИМ значения
           while (loopCount > 0)
(
loopCount = loopCount — 1;
сout << "Осталось выполнить "
<< loopCount << " циклов\п";
}
return 0;
Добавлено через 24 секунды
я незнаю знал бы не спрашивал

Добавлено через 5 минут
C++
1
2
3
4
5
6
7
8
9
10
11
12
13
14
15
16
17
18
19
20
21
22
23
24
25
26
// WhileDemo — введите счетчик цикла.
// Программа выводит количество выполненных
// циклов while
#include: <stdio.h>
# include: < lostream. h>
int main(int arg, char* pszArgs[])
{
           // ввод счетчика цикла
           int loopCount;
           cout << "Введите loopCount: ";
          cin >> loopCount;
          
          // теперь в цикле ЕЫВОДИМ значения
           while (loopCount > 0)
}
loopCount = loopCount — 1;
сout << "Осталось выполнить "
<< loopCount << " циклов\п";
// в цикле выводим значения
while (loopCount > 0)
{
loopCount--;
cout << "Осталось выполнить "
« loopCount << " циклов\п";
}
return 0;
Добавлено через 42 секунды
http://codepad.org/J8YxR4CU
Nameless One
Эксперт С++
5769 / 3418 / 255
Регистрация: 08.02.2010
Сообщений: 7,446
17.04.2011, 07:22     ошибка в коде #6
C++
1
2
3
4
5
6
7
8
9
10
11
12
13
14
15
16
#include <iostream>
 
int main()
{
  int loopCount;
  std::cout << "Input loop count: ";
  std::cin >> loopCount;
  if(loopCount < 0)
  {
    std::cerr << "Loop count must be non-negative!" << std::endl;
    return 1;
  }
  while(loopCount--)
    std::cout << "Loop body will be executed " << loopCount << " more time(s)" << std::endl;
  return 0;
}
ValeryS
Модератор
6550 / 5016 / 463
Регистрация: 14.02.2011
Сообщений: 16,729
17.04.2011, 07:22     ошибка в коде #7
Цитата Сообщение от ELDQS Посмотреть сообщение
# include: < lostream. h>
# include: <iostream.h>
не л а и
и без пробелов
ELDQS
10 / 10 / 1
Регистрация: 07.04.2011
Сообщений: 561
Записей в блоге: 1
17.04.2011, 07:24  [ТС]     ошибка в коде #8
Line 8: error: #include expects "FILENAME" or <FILENAME>
Line 9: error: #include expects "FILENAME" or <FILENAME>
Line 16: error: stray '\342' in program
compilation terminated due to -Wfatal-errors
ValeryS
Модератор
6550 / 5016 / 463
Регистрация: 14.02.2011
Сообщений: 16,729
17.04.2011, 07:28     ошибка в коде #9
со скобками разберись
Nameless One
Эксперт С++
5769 / 3418 / 255
Регистрация: 08.02.2010
Сообщений: 7,446
17.04.2011, 07:28     ошибка в коде #10
ELDQS, http://ideone.com/0hGkL
Nameless One
Эксперт С++
5769 / 3418 / 255
Регистрация: 08.02.2010
Сообщений: 7,446
17.04.2011, 07:31     ошибка в коде #11
ELDQS, это даже не ошибки, это катастрофа.
Видно, что текст программы скопирован (или написан) вообще безо всякого понимания синтаксиса языка.
MoreAnswers
Эксперт
37091 / 29110 / 5898
Регистрация: 17.06.2006
Сообщений: 43,301
17.04.2011, 07:42     ошибка в коде
Еще ссылки по теме:

Ошибка в коде - C++
Добрый вечер! Объясните чайнику, почему не компилируется код. Ругается на 5, 7, 11, 17, 19, 21, 23 строки. / WhileDemo - введите...

Ошибка в коде - C++
Задание: Напишите и продемонстрируйте работу программы, выводящей на экран в двоичной форме целое число типа int . Для получения...

Ошибка в коде. - C++
Простая программа: просто ввод и вывод матрицы. Выдает ошибку уже после компиляции. Мой код: #include &lt;stdio.h&gt; #include...

Ошибка в коде - C++
ЗАДАНИЕ. . Составить программу для вычисления указанных выражений с использованием пользовательских функций. Вид вычисляемого функцией...

Ошибка с else/else if в коде - C++
Подчеркивает else(else if все нормально), ошибка:требуется оператор. Как с этим бороться?) Заранее спасибо. ............ case'f':...


Искать еще темы с ответами

Или воспользуйтесь поиском по форуму:
ELDQS
10 / 10 / 1
Регистрация: 07.04.2011
Сообщений: 561
Записей в блоге: 1
17.04.2011, 07:42  [ТС]     ошибка в коде #12
аха понял спасибо
Yandex
Объявления
17.04.2011, 07:42     ошибка в коде
Ответ Создать тему
Опции темы

КиберФорум - форум программистов, компьютерный форум, программирование
Powered by vBulletin® Version 3.8.9
Copyright ©2000 - 2017, vBulletin Solutions, Inc.
Рейтинг@Mail.ru