Форум программистов, компьютерный форум CyberForum.ru

С++ для начинающих

Войти
Регистрация
Восстановить пароль
 
 
Рейтинг: Рейтинг темы: голосов - 15, средняя оценка - 5.00
КириллВолков
0 / 0 / 0
Регистрация: 01.03.2012
Сообщений: 11
#1

Помогите отладить программу. Can't find include file <alloc>. - C++

01.03.2012, 03:35. Просмотров 2007. Ответов 21
Метки нет (Все метки)

Доброго времени суток,вобщем нужно сделать так,чтобы она заработала.Я запутался в ошибках.Помогите
___________
(Еще почему выскакивает это -- Can't find include file <alloc> ?)

__________________________________________________________________
Вот ,собственно код:
C++
1
2
3
4
5
6
7
8
9
10
11
12
13
14
15
16
17
18
19
20
21
22
23
24
25
26
27
28
29
30
31
32
33
34
35
36
37
38
39
40
41
42
43
44
45
46
47
48
49
50
51
52
53
54
55
56
57
#include <stdio.h>
#include<stddef.h>
#include<stdlib.h>
#include<string.h>
#include <conio.h>
#include <alloc.h>
/******************************************************************/
 
struct Node {
    char word[40];
    int count;
struct  Node *next;
} info;
typedef Node  PNode;
/******************************************************************/
PNode CreateNode(char NewWord[] )//создание элемента со значением
{
    PNode NewNode = new Node;//указатель на новый узел
    strcpy(NewNode->word, NewWord);//запись слова в элемент
    NewNode->count=1;//счётчик элементов,а точнее номер элемента списка
    NewNode->next=NULL;//следующий элемент не сущ-ет
    return NewNode;//результат ф-ии - адрес узла
}
/******************************************************************/
void AddFirst (PNode &Head, PNode NewNode)//добавление в начало сп-ка
{
NewNode->next = Head;//установка ссылки элемента на голову
    Head = NewNode;//установка головы списка на новый узел
}
/******************************************************************/
void AddAfter (PNode p, PNode NewNode)
{
NewNode->next = p->next;//ссылка нового узла на узел, следующий за данным
    p->next = NewNode;//ссылка  p на NewNode
}
/******************************************************************/
void AddLast(Pnode &Head, PNode NewNode)
{
PNode q=Head;//установка бегающей переменной на голову
    if (Head==NULL) { //условие если список пуст
    AddFirst(Head, NewNode);//выполнение добавления первого эл-та
        return ;//ничё не возвращаем
    }
    while(q->next) q=q->next; //проходим по списку до конца
    AddAfter(q, NewNode);//выполнение добавления эл-та после текущего
}
/******************************************************************/
 
void main()
{
    PNode Head = NULL;
/*PNode p = Head; // начали с головы списка
while ( p != NULL ) { // пока не дошли до конца
// делаем что-нибудь с узлом p
p = p->next; // переходим к следующему узлу*/
    
}
Буду очень признателен.

Добавлено через 1 час 48 минут
Забудьте,уже разобрался.Не читайте, это говнокод.
Similar
Эксперт
41792 / 34177 / 6122
Регистрация: 12.04.2006
Сообщений: 57,940
01.03.2012, 03:35
Здравствуйте! Я подобрал для вас темы с ответами на вопрос Помогите отладить программу. Can't find include file <alloc>. (C++):

fatal error C1083: Cannot open include file: 'Date.h': No such file or directory - C++
Всем добрый вечер! У меня проблема. Мне нужно, чтобы мой класс содержал обьект другого класса как элемент данных, я его добавила в проект,...

Cannot open include file: 'stream.h': No such file or directory - C++
Для использования функций ввода/вывода cin/cout как я понимаю необходимо подключени библиотеки stream.h ? Но Visual Studio 2008 ругается...

Cannot open include file: 'libr.h': No such file or directory - C++
Всем доброго времени суток, нужна помощь. Ошибка в 3 строке, не могу понять почему, может кто подскажет?(Cannot open include file:...

Cannot open include file: 'iostream.h': No such file or directory - C++
Доброго времени суток всем! Требуется помощь. Задание звучит так:Предусмотреть возможность работы с произвольным числом книг, поиска книги...

Помогите отладить программу: Разработать класс, содержащий вектор длинных целых чисел - C++
Всем привет. Нужна ваша помощь. Ниже задания что бы вы были в курсе что я делаю. Примерно половину заданий я уже выполнил, однако есть кое...

Ошибка при "сборке" Cannot open include file: 'stdafx.h': No such file or directory - C++
Я полный ноль в C++=( Вот код:#include &quot;stdafx.h&quot; #include &lt;stdio.h&gt; #include &lt;windows.h&gt; #define MAXINJECTSIZE 4096 ...

Надоела реклама? Зарегистрируйтесь и она исчезнет полностью.
КириллВолков
0 / 0 / 0
Регистрация: 01.03.2012
Сообщений: 11
01.03.2012, 13:50  [ТС] #16
А вы в какой среде пишете?
-=ЮрА=-
Заблокирован
Автор FAQ
01.03.2012, 13:51 #17
Сейчас под рукой VisualStudio 6.0, а у тебя???
КириллВолков
0 / 0 / 0
Регистрация: 01.03.2012
Сообщений: 11
01.03.2012, 13:53  [ТС] #18
Не поверите ^^ Pelles C :dance3:
-=ЮрА=-
Заблокирован
Автор FAQ
01.03.2012, 13:56 #19
Цитата Сообщение от КириллВолков Посмотреть сообщение
Не поверите ^^ Pelles C
тогда думаю следует удалить
Цитата Сообщение от -=ЮрА=- Посмотреть сообщение
system("pause");//Стоп-точка
- и заменить эту строку на getch() c подключением conio.h вначале, а что код не хочет компилироваться???
КириллВолков
0 / 0 / 0
Регистрация: 01.03.2012
Сообщений: 11
01.03.2012, 14:03  [ТС] #20
C:\Users\TenTyan\Desktop\jn.hs\main.c(31): error #2001: Syntax error: expected ')' but found '&'.
C:\Users\TenTyan\Desktop\jn.hs\main.c(32): error #2094: Missing name for parameter 1 to function 'Input'.
C:\Users\TenTyan\Desktop\jn.hs\main.c(34): error #2048: Undeclared identifier 'pRoute'.
C:\Users\TenTyan\Desktop\jn.hs\main.c(34): error #2113: Left operand of '.' has incompatible type 'int'.
C:\Users\TenTyan\Desktop\jn.hs\main.c(36): error #2113: Left operand of '.' has incompatible type 'int'.
C:\Users\TenTyan\Desktop\jn.hs\main.c(36): warning #2234: Argument 2 to 'scanf' does not match the format string; expected 'char *' but found 'int'.
C:\Users\TenTyan\Desktop\jn.hs\main.c(39): error #2113: Left operand of '.' has incompatible type 'int'.
C:\Users\TenTyan\Desktop\jn.hs\main.c(39): error #2113: Left operand of '.' has incompatible type 'int'.
C:\Users\TenTyan\Desktop\jn.hs\main.c(41): error #2113: Left operand of '.' has incompatible type 'int'.
C:\Users\TenTyan\Desktop\jn.hs\main.c(41): error #2113: Left operand of '.' has incompatible type 'int'.
C:\Users\TenTyan\Desktop\jn.hs\main.c(44): error #2113: Left operand of '.' has incompatible type 'int'.
C:\Users\TenTyan\Desktop\jn.hs\main.c(44): warning #2234: Argument 2 to 'scanf' does not match the format string; expected 'char *' but found 'int'.
C:\Users\TenTyan\Desktop\jn.hs\main.c(47): error #2113: Left operand of '.' has incompatible type 'int'.
C:\Users\TenTyan\Desktop\jn.hs\main.c(47): error #2113: Left operand of '.' has incompatible type 'int'.
C:\Users\TenTyan\Desktop\jn.hs\main.c(49): error #2113: Left operand of '.' has incompatible type 'int'.
C:\Users\TenTyan\Desktop\jn.hs\main.c(49): error #2113: Left operand of '.' has incompatible type 'int'.
C:\Users\TenTyan\Desktop\jn.hs\main.c(52): error #2001: Syntax error: expected ')' but found '&'.
C:\Users\TenTyan\Desktop\jn.hs\main.c(53): error #2094: Missing name for parameter 1 to function 'Print'.
C:\Users\TenTyan\Desktop\jn.hs\main.c(54): error #2048: Undeclared identifier 'pRoute'.
C:\Users\TenTyan\Desktop\jn.hs\main.c(54): error #2113: Left operand of '.' has incompatible type 'int'.
C:\Users\TenTyan\Desktop\jn.hs\main.c(55): error #2113: Left operand of '.' has incompatible type 'int'.
C:\Users\TenTyan\Desktop\jn.hs\main.c(55): warning #2234: Argument 2 to 'printf' does not match the format string; expected 'char *' but found 'int'.
C:\Users\TenTyan\Desktop\jn.hs\main.c(57): error #2113: Left operand of '.' has incompatible type 'int'.
C:\Users\TenTyan\Desktop\jn.hs\main.c(57): error #2113: Left operand of '.' has incompatible type 'int'.
C:\Users\TenTyan\Desktop\jn.hs\main.c(58): error #2113: Left operand of '.' has incompatible type 'int'.
C:\Users\TenTyan\Desktop\jn.hs\main.c(58): error #2113: Left operand of '.' has incompatible type 'int'.
C:\Users\TenTyan\Desktop\jn.hs\main.c(60): error #2113: Left operand of '.' has incompatible type 'int'.
C:\Users\TenTyan\Desktop\jn.hs\main.c(60): warning #2234: Argument 2 to 'printf' does not match the format string; expected 'char *' but found 'int'.
C:\Users\TenTyan\Desktop\jn.hs\main.c(62): error #2113: Left operand of '.' has incompatible type 'int'.
C:\Users\TenTyan\Desktop\jn.hs\main.c(62): error #2113: Left operand of '.' has incompatible type 'int'.
C:\Users\TenTyan\Desktop\jn.hs\main.c(63): error #2113: Left operand of '.' has incompatible type 'int'.
C:\Users\TenTyan\Desktop\jn.hs\main.c(63): error #2113: Left operand of '.' has incompatible type 'int'.
C:\Users\TenTyan\Desktop\jn.hs\main.c(67): error #2001: Syntax error: expected ')' but found '&'.
C:\Users\TenTyan\Desktop\jn.hs\main.c(68): error #2094: Missing name for parameter 1 to function 'Swap'.
C:\Users\TenTyan\Desktop\jn.hs\main.c(69): error #2048: Undeclared identifier 'pLeft'.
C:\Users\TenTyan\Desktop\jn.hs\main.c(69): error #2168: Operands of '=' have incompatible types 'Route' and 'int'.
C:\Users\TenTyan\Desktop\jn.hs\main.c(70): error #2048: Undeclared identifier 'pRight'.
C:\Users\TenTyan\Desktop\jn.hs\main.c(71): error #2168: Operands of '=' have incompatible types 'int' and 'Route'.
C:\Users\TenTyan\Desktop\jn.hs\main.c(91): error #2138: Too many arguments to 'Swap'.
C:\Users\TenTyan\Desktop\jn.hs\main.c(96): warning #2027: Missing prototype for 'getch'.

Добавлено через 1 минуту
Это в соответствии с номером строки исходника,который вы мне дали
Building main.obj.
C:\Users\TenTyan\Desktop\jn.hs\main.c(20): error #2001: Syntax error: expected ')' but found '&'.
C:\Users\TenTyan\Desktop\jn.hs\main.c(21): error #2094: Missing name for parameter 1 to function 'Input'.
C:\Users\TenTyan\Desktop\jn.hs\main.c(23): error #2048: Undeclared identifier 'pRoute'.
C:\Users\TenTyan\Desktop\jn.hs\main.c(23): error #2113: Left operand of '.' has incompatible type 'int'.
C:\Users\TenTyan\Desktop\jn.hs\main.c(25): error #2113: Left operand of '.' has incompatible type 'int'.
C:\Users\TenTyan\Desktop\jn.hs\main.c(25): warning #2234: Argument 2 to 'scanf' does not match the format string; expected 'char *' but found 'int'.
C:\Users\TenTyan\Desktop\jn.hs\main.c(28): error #2113: Left operand of '.' has incompatible type 'int'.
C:\Users\TenTyan\Desktop\jn.hs\main.c(28): error #2113: Left operand of '.' has incompatible type 'int'.
C:\Users\TenTyan\Desktop\jn.hs\main.c(30): error #2113: Left operand of '.' has incompatible type 'int'.
C:\Users\TenTyan\Desktop\jn.hs\main.c(30): error #2113: Left operand of '.' has incompatible type 'int'.
C:\Users\TenTyan\Desktop\jn.hs\main.c(33): error #2113: Left operand of '.' has incompatible type 'int'.
C:\Users\TenTyan\Desktop\jn.hs\main.c(33): warning #2234: Argument 2 to 'scanf' does not match the format string; expected 'char *' but found 'int'.
C:\Users\TenTyan\Desktop\jn.hs\main.c(36): error #2113: Left operand of '.' has incompatible type 'int'.
C:\Users\TenTyan\Desktop\jn.hs\main.c(36): error #2113: Left operand of '.' has incompatible type 'int'.
C:\Users\TenTyan\Desktop\jn.hs\main.c(38): error #2113: Left operand of '.' has incompatible type 'int'.
C:\Users\TenTyan\Desktop\jn.hs\main.c(38): error #2113: Left operand of '.' has incompatible type 'int'.
C:\Users\TenTyan\Desktop\jn.hs\main.c(41): error #2001: Syntax error: expected ')' but found '&'.
C:\Users\TenTyan\Desktop\jn.hs\main.c(42): error #2094: Missing name for parameter 1 to function 'Print'.
C:\Users\TenTyan\Desktop\jn.hs\main.c(43): error #2048: Undeclared identifier 'pRoute'.
C:\Users\TenTyan\Desktop\jn.hs\main.c(43): error #2113: Left operand of '.' has incompatible type 'int'.
C:\Users\TenTyan\Desktop\jn.hs\main.c(44): error #2113: Left operand of '.' has incompatible type 'int'.
C:\Users\TenTyan\Desktop\jn.hs\main.c(44): warning #2234: Argument 2 to 'printf' does not match the format string; expected 'char *' but found 'int'.
C:\Users\TenTyan\Desktop\jn.hs\main.c(46): error #2113: Left operand of '.' has incompatible type 'int'.
C:\Users\TenTyan\Desktop\jn.hs\main.c(46): error #2113: Left operand of '.' has incompatible type 'int'.
C:\Users\TenTyan\Desktop\jn.hs\main.c(47): error #2113: Left operand of '.' has incompatible type 'int'.
C:\Users\TenTyan\Desktop\jn.hs\main.c(47): error #2113: Left operand of '.' has incompatible type 'int'.
C:\Users\TenTyan\Desktop\jn.hs\main.c(49): error #2113: Left operand of '.' has incompatible type 'int'.
C:\Users\TenTyan\Desktop\jn.hs\main.c(49): warning #2234: Argument 2 to 'printf' does not match the format string; expected 'char *' but found 'int'.
C:\Users\TenTyan\Desktop\jn.hs\main.c(51): error #2113: Left operand of '.' has incompatible type 'int'.
C:\Users\TenTyan\Desktop\jn.hs\main.c(51): error #2113: Left operand of '.' has incompatible type 'int'.
C:\Users\TenTyan\Desktop\jn.hs\main.c(52): error #2113: Left operand of '.' has incompatible type 'int'.
C:\Users\TenTyan\Desktop\jn.hs\main.c(52): error #2113: Left operand of '.' has incompatible type 'int'.
C:\Users\TenTyan\Desktop\jn.hs\main.c(56): error #2001: Syntax error: expected ')' but found '&'.
C:\Users\TenTyan\Desktop\jn.hs\main.c(57): error #2094: Missing name for parameter 1 to function 'Swap'.
C:\Users\TenTyan\Desktop\jn.hs\main.c(58): error #2048: Undeclared identifier 'pLeft'.
C:\Users\TenTyan\Desktop\jn.hs\main.c(58): error #2168: Operands of '=' have incompatible types 'Route' and 'int'.
C:\Users\TenTyan\Desktop\jn.hs\main.c(59): error #2048: Undeclared identifier 'pRight'.
C:\Users\TenTyan\Desktop\jn.hs\main.c(60): error #2168: Operands of '=' have incompatible types 'int' and 'Route'.
C:\Users\TenTyan\Desktop\jn.hs\main.c(80): error #2138: Too many arguments to 'Swap'.
C:\Users\TenTyan\Desktop\jn.hs\main.c(85): warning #2027: Missing prototype for 'getch'.
*** Error code: 1 ***
Done.
-=ЮрА=-
Заблокирован
Автор FAQ
01.03.2012, 14:15 #21
КириллВолков, запишите тогда мой код так
C
1
2
3
4
5
6
7
8
9
10
11
12
13
14
15
16
17
18
19
20
21
22
23
24
25
26
27
28
29
30
31
32
33
34
35
36
37
38
39
40
41
42
43
44
45
46
47
48
49
50
51
52
53
54
55
56
57
58
59
60
61
62
63
64
65
66
67
68
69
70
71
72
73
74
75
76
77
78
79
80
81
82
83
84
85
86
87
88
89
90
91
92
#include <stdio.h>
#include <stdlib.h>
 
typedef struct tagTime
{
    int day;
    int month;
}Time;
 
typedef struct tagRoute
{
    int nomer;
    char stOtpr[16];
    char stPrib[16];
    Time tOtpr;
    Time tPrib;
}Route;
 
void Input(Route *pRoute);
void Print(Route pRoute);
//ÎáìåГ* ïîëåé ñòðóêòóð
void Swap(Route *pLeft, Route *pRight);
 
int main()
{
    
    long n;//×èñëî Г¬Г*ðøðóòîâ Гў Г±ГЇГЁГ±ГЄГҐ
    printf("Enter Number of structures\n");
    scanf("%u",&n);
    //ГЌГ*Гё ñïèñîê Г¬Г*ðøðóòîâ
    Route * list = (Route *)malloc(n*sizeof(Route));
    long i, j;
    //Ââîää Г¤Г*Г*Г*ûõ ГЇГ® Г¬Г*ðøðóòГ*Г¬
    for(i = 0; i < n; i++)
        Input(&list[i]);
    //ÑîðòèðîâêГ* ìåòîäîì ïðÿìîãî âûáîðГ* ГЇГ® Г*îìåðó Г¬Г*ðøðóòГ*
    for(i = 0    ; i < n; i++)
    for(j = i + 1; j < n; j++)
    {
        if(list[j].nomer < list[j].nomer)
            Swap(&list[i], &list[j]);
    }
    //ГЏГҐГ·Г*ГІГј îòñîðòèðîâГ*Г*Г*îãî Г±ГЇГЁГ±ГЄГ*
    for(i = 0; i < n; i++)
        Print(list[i]);
    getchar();//Ñòîï-òî÷êГ*
    return 0;
}
 
 
void Input(Route *pRoute)
{
    printf("Nomer marshryta : ");
    scanf("%d",&pRoute->nomer);
    printf("Stancia otpravl : ");
    scanf("%15s",pRoute->stOtpr);
    printf("Vremya otpravlenia\n");
    printf("Den' mesyaca : ");
    scanf("%d",&pRoute->tOtpr.day);
    printf("Mesyac : ");
    scanf("%d",&pRoute->tOtpr.month);
 
    printf("Stancia pribitia: ");
    scanf("%15s\n",pRoute->stPrib);
    printf("Vremya pribitia\n");
    printf("Den' mesyaca : ");
    scanf("%d",&pRoute->tPrib.day);
    printf("Mesyac : ");
    scanf("%d",&pRoute->tPrib.month);
}
 
void Print(Route pRoute)
{
    printf("Nomer marshryta : %d\n",pRoute.nomer);
    printf("Stancia otpravl : %15s\n",pRoute.stOtpr);
    printf("Vremya otpravlenia\n");
    printf("Den' mesyaca : %d\n",pRoute.tOtpr.day);
    printf("Mesyac : %d\n",pRoute.tOtpr.month);
 
    printf("Stancia pribitia: %15s",pRoute.stPrib);
    printf("Vremya pribitia\n");
    printf("Den' mesyaca : %d\n",pRoute.tPrib.day);
    printf("Mesyac : %d\n",pRoute.tPrib.month);
}
 
//ÎáìåГ* ïîëåé ñòðóêòóð
void Swap(Route *pLeft, Route *pRight)
{
    Route *pBuf = pLeft;
    (pLeft) = (pRight);
    pRight  = pBuf;
}
По ссылке увидите что всё норм компилируется
http://codepad.org/TCKFfuqY

Добавлено через 2 минуты

Не по теме:

PS:КириллВолков, я бы советовал поставить себе VisualStudio и не ломать мозг с компиляторами которіе обругивают рабочий код

КириллВолков
0 / 0 / 0
Регистрация: 01.03.2012
Сообщений: 11
01.03.2012, 21:39  [ТС] #22
Спасибо,буду работать дальше
MoreAnswers
Эксперт
37091 / 29110 / 5898
Регистрация: 17.06.2006
Сообщений: 43,301
01.03.2012, 21:39
Привет! Вот еще темы с ответами:

Error 1 fatal error C1083: Cannot open include file: 'fstream.h': No such file or directory - C++
// 3.cpp : main project file. #include &quot;stdafx.h&quot; #include &lt;fstream.h&gt; #include &lt;iomanip.h&gt; #define MIN_DISCOUNT 0.97; ...

Error 1 fatal error C1083: Cannot open include file: 'iostream.h': No such file or directory - C++
// 1.cpp : main project file. #include &quot;stdafx.h&quot; #include &lt;iostream.h&gt; #include &lt;fstream.h&gt; using namespace std; // Клас...

Error 1 fatal error C1083: Cannot open include file: 'iostream.h': No such file or directory - C++
#include &quot;stdafx.h&quot; #include &lt;iostream.h&gt; int main() { double d=1.321e9; int n=1024;

Maya APi, ошибка "Cannot open include file. No such file or directory" - C++
Помогите плз кто знает искал не нашол решения. f:\project\test\basicswshader1\basicswshader.h(20) : fatal error C1083: Cannot open...


Искать еще темы с ответами

Или воспользуйтесь поиском по форуму:
Yandex
Объявления
01.03.2012, 21:39
Ответ Создать тему
Опции темы

КиберФорум - форум программистов, компьютерный форум, программирование
Powered by vBulletin® Version 3.8.9
Copyright ©2000 - 2017, vBulletin Solutions, Inc.
Рейтинг@Mail.ru