Форум программистов, компьютерный форум, киберфорум
Наши страницы

С++ для начинающих

Войти
Регистрация
Восстановить пароль
 
Оператор пк
10 / 10 / 1
Регистрация: 09.08.2010
Сообщений: 158
#1

Fatal error. Inconsistent values. - C++

30.03.2012, 14:00. Просмотров 765. Ответов 0
Метки нет (Все метки)

C++
1
2
3
2>  SUN_Proactor.cpp
2>c1xx : fatal error C1027: Inconsistent values for /Ym between creation and use of precompiled header
2>c1xx : fatal error C1027: Inconsistent values for /Ym between creation and use of precompiled header
при компиляции выбевает кучу таких ошибок ,но раньше такого не было что делать ?
0
Надоела реклама? Зарегистрируйтесь и она исчезнет полностью.
Similar
Эксперт
41792 / 34177 / 6122
Регистрация: 12.04.2006
Сообщений: 57,940
30.03.2012, 14:00
Здравствуйте! Я подобрал для вас темы с ответами на вопрос Fatal error. Inconsistent values. (C++):

[Linker Fatal Error] Fatal: Unable to open file 'CXGRIDVCLC6.LIB' - C++
Установил компоненты DevExpress, вроде все нормально, но при компиляции нового проекта выдает: Fatal: Unable to open file...

Error 1 fatal error C1093: API call 'ImportFile' failed '0x80070003' : ErrorMessage: - C++
// Lab7_1.cpp : main project file. #include "stdafx.h" #include <iostream> using namespace std; float y; void...

Error C2760: синтаксическая ошибка / Fatal error C1004: непредвиденное обнаружение конца файла - C++
Набыдлокодил следующее: Graph.h template<class D> class Graph { private: class Edge { private: int v1, v2;

Ошибки fatal error U1052 и error MSB3073 - C++
Здравствуйте! Подскажите, пожалуйста, как исправить ошибки fatal error U1052 и error MSB3073 при компиляции решения в MSVS 2012. ...

fatal error LNK1318: Unexpected PDB error; OK (0) '' - C++
При компиляции (VS2010) возникает такая ошибка: fatal error LNK1318: Unexpected PDB error; OK (0) '' как можно её исправить?

error C2601: 'main' : local function definitions are illegal fatal error C1004: unexpected end of file found - C++
День добрый люди написал програму выдает 2 ошибки че не так подскажите error C2601: 'main' : local function definitions are illegal ...

0
MoreAnswers
Эксперт
37091 / 29110 / 5898
Регистрация: 17.06.2006
Сообщений: 43,301
30.03.2012, 14:00
Привет! Вот еще темы с ответами:

Error LNK2019 и fatal error LNK1120 - C++
Копаюсь в гугле уже часа 2. Не понимаю, в чем проблема. Вроде нигде ошибок в коде нету, но выдает: 1>------ Построение начато:...

Error 1 fatal error C1083: Cannot open include file: 'fstream.h': No such file or directory - C++
// 3.cpp : main project file. #include "stdafx.h" #include <fstream.h> #include <iomanip.h> #define MIN_DISCOUNT 0.97; ...

Error 1 fatal error C1083: Cannot open include file: 'iostream.h': No such file or directory - C++
// 1.cpp : main project file. #include "stdafx.h" #include <iostream.h> #include <fstream.h> using namespace std; // Клас...

Error 1 fatal error C1083: Cannot open include file: 'iostream.h': No such file or directory - C++
#include "stdafx.h" #include <iostream.h> int main() { double d=1.321e9; int n=1024;


Искать еще темы с ответами

Или воспользуйтесь поиском по форуму:
1
Ответ Создать тему
Опции темы

КиберФорум - форум программистов, компьютерный форум, программирование
Powered by vBulletin® Version 3.8.9
Copyright ©2000 - 2017, vBulletin Solutions, Inc.