Форум программистов, компьютерный форум CyberForum.ru
Наши страницы

С++ для начинающих

Войти
Регистрация
Восстановить пароль
 
 
Рейтинг: Рейтинг темы: голосов - 27, средняя оценка - 4.89
Pavel1133
3 / 3 / 0
Регистрация: 12.10.2009
Сообщений: 81
#1

в чем ошибка ?(( - C++

12.10.2009, 17:28. Просмотров 3451. Ответов 28
Метки нет (Все метки)

Программа для возведеня в степень число, я не понимаю в чём проблема

C++
1
2
3
4
5
6
7
8
9
10
11
12
13
14
15
#include <iostream>
using namespace std;
int main();
int j=1; i , N, w;
cout << "vvedite 4islo" << endl;
cin >> i << endl;
w=i;
cout << "vvedite stepen'" << endl;
cin >> N << endl;
while (j<N) {
    i=i*w;
    j++;
}
cout << i << endl;
system("pause");
собственно ошибки тут
И вот ошибки которые я не пойму ((

1>------ Build started: Project: aaa, Configuration: Debug Win32 ------
1>Compiling...
1>Source1.cpp
1>c:\documents and settings\администратор\мои документы\visual studio 2008\projects\aaa\aaa\source1.cpp(4) : error C4430: missing type specifier - int assumed. Note: C++ does not support default-int
1>c:\documents and settings\администратор\мои документы\visual studio 2008\projects\aaa\aaa\source1.cpp(4) : error C4430: missing type specifier - int assumed. Note: C++ does not support default-int
1>c:\documents and settings\администратор\мои документы\visual studio 2008\projects\aaa\aaa\source1.cpp(4) : error C4430: missing type specifier - int assumed. Note: C++ does not support default-int
1>c:\documents and settings\администратор\мои документы\visual studio 2008\projects\aaa\aaa\source1.cpp(5) : error C2143: syntax error : missing ';' before '<<'
1>c:\documents and settings\администратор\мои документы\visual studio 2008\projects\aaa\aaa\source1.cpp(5) : error C4430: missing type specifier - int assumed. Note: C++ does not support default-int
1>c:\documents and settings\администратор\мои документы\visual studio 2008\projects\aaa\aaa\source1.cpp(6) : error C2143: syntax error : missing ';' before '>>'
1>c:\documents and settings\администратор\мои документы\visual studio 2008\projects\aaa\aaa\source1.cpp(6) : error C4430: missing type specifier - int assumed. Note: C++ does not support default-int
1>c:\documents and settings\администратор\мои документы\visual studio 2008\projects\aaa\aaa\source1.cpp(7) : error C4430: missing type specifier - int assumed. Note: C++ does not support default-int
1>c:\documents and settings\администратор\мои документы\visual studio 2008\projects\aaa\aaa\source1.cpp(7) : error C2086: 'int w' : redefinition
1> c:\documents and settings\администратор\мои документы\visual studio 2008\projects\aaa\aaa\source1.cpp(4) : see declaration of 'w'
1>c:\documents and settings\администратор\мои документы\visual studio 2008\projects\aaa\aaa\source1.cpp(8) : error C2143: syntax error : missing ';' before '<<'
1>c:\documents and settings\администратор\мои документы\visual studio 2008\projects\aaa\aaa\source1.cpp(8) : error C4430: missing type specifier - int assumed. Note: C++ does not support default-int
1>c:\documents and settings\администратор\мои документы\visual studio 2008\projects\aaa\aaa\source1.cpp(8) : error C2086: 'int cout' : redefinition
1> c:\documents and settings\администратор\мои документы\visual studio 2008\projects\aaa\aaa\source1.cpp(5) : see declaration of 'cout'
1>c:\documents and settings\администратор\мои документы\visual studio 2008\projects\aaa\aaa\source1.cpp(9) : error C2143: syntax error : missing ';' before '>>'
1>c:\documents and settings\администратор\мои документы\visual studio 2008\projects\aaa\aaa\source1.cpp(9) : error C4430: missing type specifier - int assumed. Note: C++ does not support default-int
1>c:\documents and settings\администратор\мои документы\visual studio 2008\projects\aaa\aaa\source1.cpp(9) : error C2086: 'int cin' : redefinition
1> c:\documents and settings\администратор\мои документы\visual studio 2008\projects\aaa\aaa\source1.cpp(6) : see declaration of 'cin'
1>c:\documents and settings\администратор\мои документы\visual studio 2008\projects\aaa\aaa\source1.cpp(10) : error C2059: syntax error : 'while'
1>c:\documents and settings\администратор\мои документы\visual studio 2008\projects\aaa\aaa\source1.cpp(10) : error C2143: syntax error : missing ';' before '{'
1>c:\documents and settings\администратор\мои документы\visual studio 2008\projects\aaa\aaa\source1.cpp(10) : error C2447: '{' : missing function header (old-style formal list?)
1>c:\documents and settings\администратор\мои документы\visual studio 2008\projects\aaa\aaa\source1.cpp(14) : error C2143: syntax error : missing ';' before '<<'
1>c:\documents and settings\администратор\мои документы\visual studio 2008\projects\aaa\aaa\source1.cpp(14) : error C4430: missing type specifier - int assumed. Note: C++ does not support default-int
1>c:\documents and settings\администратор\мои документы\visual studio 2008\projects\aaa\aaa\source1.cpp(14) : error C2086: 'int cout' : redefinition
1> c:\documents and settings\администратор\мои документы\visual studio 2008\projects\aaa\aaa\source1.cpp(5) : see declaration of 'cout'
1>c:\documents and settings\администратор\мои документы\visual studio 2008\projects\aaa\aaa\source1.cpp(15) : error C4430: missing type specifier - int assumed. Note: C++ does not support default-int
1>c:\documents and settings\администратор\мои документы\visual studio 2008\projects\aaa\aaa\source1.cpp(15) : error C2365: 'system' : redefinition; previous definition was 'function'
1> d:\mvs c++\vc\include\stdlib.h(521) : see declaration of 'system'
1>c:\documents and settings\администратор\мои документы\visual studio 2008\projects\aaa\aaa\source1.cpp(15) : error C2440: 'initializing' : cannot convert from 'const char [6]' to 'int'
1> There is no context in which this conversion is possible
1>Build log was saved at "file://c:\Documents and Settings\Администратор\Мои документы\Visual Studio 2008\Projects\aaa\aaa\Debug\BuildLog.htm"
1>aaa - 24 error(s), 0 warning(s)
========== Build: 0 succeeded, 1 failed, 0 up-to-date, 0 skipped ==========
0
Надоела реклама? Зарегистрируйтесь и она исчезнет полностью.
Similar
Эксперт
41792 / 34177 / 6122
Регистрация: 12.04.2006
Сообщений: 57,940
12.10.2009, 17:28
Здравствуйте! Я подобрал для вас темы с ответами на вопрос в чем ошибка ?(( (C++):

Реализовать через тип данных структура. При сборке и отладки возникает ошибка. В чем ошибка? - C++
С++ в таблице из 5 строк хранятся данные о товарах: наименование, цена, количество. Определить и вывести наименование товара, цена которого...

Ошибка 2 error LNK2019, не пойму в чем ошибка - C++
Выдает такую ошибку: Ошибка 2 error LNK2019: ссылка на неразрешенный внешний символ &quot;int __cdecl game(void)&quot; (?game@@YAHXZ) в функции....

в чем ошибка - C++
#include &lt;stdio.h&gt; #include &lt;conio.h&gt; void vvod(int a) { printf(&quot;Ââåäèòå ìàòðèöó:\n&quot;); printf(&quot;Ââåäèòå ìàòðèöó:\n&quot;); for (int...

В чем ошибка? - C++
Вводим количество элементов, например 5, потом матрицу 1 2 0 0 0 программа должна вывести 1 2 0 3, но что то нетак #include...

В чем ошибка? - C++
Не получается отсортировать(по именам) и найти средний бал #include &lt;iostream&gt; #include &lt;string.h&gt; #include &lt;cstring&gt; #include...

В чем ошибка? - C++
В текстовом док файле куча символов а оно стрянет на первых 7-ми только( #include &lt;iostream&gt; #include &lt;fstream&gt; #include &lt;conio.h&gt; ...

28
Ketino
8 / 8 / 0
Регистрация: 21.09.2009
Сообщений: 84
12.10.2009, 22:56 #16
Я тут вижу только ошибки компиляции.
Значит нужет ещё и код.
0
Pavel1133
3 / 3 / 0
Регистрация: 12.10.2009
Сообщений: 81
12.10.2009, 22:57  [ТС] #17
Цитата Сообщение от denver Посмотреть сообщение
Держи найди несколько отличий...
Код C++
1
2
3
4
5
6
7
8
9
10
11
12
13
14
15
16
17
18
19
20
21
22
23
24
25
#include <iostream>
using namespace std;
int main()
{
int j=1, i , N, w;
cout << "vvedite 4islo" << endl;
cin >> i;
cout << endl;
w=i;
cout << "vvedite stepen'" << endl;
cin >> N;
cout << endl;
while (j<N)
{
i=i*w;
j++;
}
cout << i;
cout << endl;
system("pause");
return 0;
}

использовал , то же самое , с компиляцией норм а с build ошибки

Добавлено через 1 минуту
1>------ Build started: Project: aaa, Configuration: Debug Win32 ------
1>Compiling...
1>Skipping... (no relevant changes detected)
1>Source1.cpp
1>Build log was saved at "file://c:\Documents and Settings\Администратор\Мои документы\Visual Studio 2008\Projects\aaa\aaa\Debug\BuildLog.htm"
1>aaa - 0 error(s), 0 warning(s)
========== Build: 1 succeeded, 0 failed, 0 up-to-date, 0 skipped ==========


просто компиляция а с Build ошибки

1>------ Build started: Project: aaa, Configuration: Debug Win32 ------
1>Compiling...
1>source 2.cpp
1>c:\documents and settings\администратор\мои документы\visual studio 2008\projects\aaa\aaa\source 2.cpp(4) : error C2143: syntax error : missing '}' before 'constant'
1>c:\documents and settings\администратор\мои документы\visual studio 2008\projects\aaa\aaa\source 2.cpp(4) : error C2143: syntax error : missing ';' before 'constant'
1>c:\documents and settings\администратор\мои документы\visual studio 2008\projects\aaa\aaa\source 2.cpp(4) : error C2143: syntax error : missing ';' before 'constant'
1>c:\documents and settings\администратор\мои документы\visual studio 2008\projects\aaa\aaa\source 2.cpp(4) : error C2143: syntax error : missing ';' before 'constant'
1>c:\documents and settings\администратор\мои документы\visual studio 2008\projects\aaa\aaa\source 2.cpp(4) : error C2143: syntax error : missing ';' before 'constant'
1>c:\documents and settings\администратор\мои документы\visual studio 2008\projects\aaa\aaa\source 2.cpp(4) : error C2143: syntax error : missing ';' before 'constant'
1>c:\documents and settings\администратор\мои документы\visual studio 2008\projects\aaa\aaa\source 2.cpp(4) : error C2143: syntax error : missing ';' before 'constant'
1>c:\documents and settings\администратор\мои документы\visual studio 2008\projects\aaa\aaa\source 2.cpp(4) : error C2143: syntax error : missing ';' before 'constant'
1>c:\documents and settings\администратор\мои документы\visual studio 2008\projects\aaa\aaa\source 2.cpp(4) : error C2143: syntax error : missing ';' before 'constant'
1>c:\documents and settings\администратор\мои документы\visual studio 2008\projects\aaa\aaa\source 2.cpp(4) : error C2143: syntax error : missing ';' before '}'
1>c:\documents and settings\администратор\мои документы\visual studio 2008\projects\aaa\aaa\source 2.cpp(6) : error C2059: syntax error : 'for'
1>c:\documents and settings\администратор\мои документы\visual studio 2008\projects\aaa\aaa\source 2.cpp(6) : error C2143: syntax error : missing ')' before ';'
1>c:\documents and settings\администратор\мои документы\visual studio 2008\projects\aaa\aaa\source 2.cpp(6) : error C2143: syntax error : missing ';' before '<'
1>c:\documents and settings\администратор\мои документы\visual studio 2008\projects\aaa\aaa\source 2.cpp(6) : error C4430: missing type specifier - int assumed. Note: C++ does not support default-int
1>c:\documents and settings\администратор\мои документы\visual studio 2008\projects\aaa\aaa\source 2.cpp(6) : error C2143: syntax error : missing ';' before '++'
1>c:\documents and settings\администратор\мои документы\visual studio 2008\projects\aaa\aaa\source 2.cpp(6) : error C4430: missing type specifier - int assumed. Note: C++ does not support default-int
1>c:\documents and settings\администратор\мои документы\visual studio 2008\projects\aaa\aaa\source 2.cpp(6) : error C2086: 'int i' : redefinition
1> c:\documents and settings\администратор\мои документы\visual studio 2008\projects\aaa\aaa\source 2.cpp(6) : see declaration of 'i'
1>c:\documents and settings\администратор\мои документы\visual studio 2008\projects\aaa\aaa\source 2.cpp(6) : error C2059: syntax error : ')'
1>c:\documents and settings\администратор\мои документы\visual studio 2008\projects\aaa\aaa\source 2.cpp(8) : error C2143: syntax error : missing ';' before '<<'
1>c:\documents and settings\администратор\мои документы\visual studio 2008\projects\aaa\aaa\source 2.cpp(8) : error C4430: missing type specifier - int assumed. Note: C++ does not support default-int
1>c:\documents and settings\администратор\мои документы\visual studio 2008\projects\aaa\aaa\source 2.cpp(9) : error C2059: syntax error : '}'
1>c:\documents and settings\администратор\мои документы\visual studio 2008\projects\aaa\aaa\source 2.cpp(9) : error C2143: syntax error : missing ';' before '}'
1>c:\documents and settings\администратор\мои документы\visual studio 2008\projects\aaa\aaa\source 2.cpp(9) : error C2059: syntax error : '}'
1>Build log was saved at "file://c:\Documents and Settings\Администратор\Мои документы\Visual Studio 2008\Projects\aaa\aaa\Debug\BuildLog.htm"
1>aaa - 23 error(s), 0 warning(s)
========== Build: 0 succeeded, 1 failed, 0 up-to-date, 0 skipped ==========
0
Ketino
8 / 8 / 0
Регистрация: 21.09.2009
Сообщений: 84
12.10.2009, 23:03 #18
У меня откомпилилось, нормально запустилось и посчитало
Попробуй всё закрыть, создать новый проект и вставить этот исходный код, который сюда скопировал - должно всё работать.
0
Pavel1133
3 / 3 / 0
Регистрация: 12.10.2009
Сообщений: 81
12.10.2009, 23:05  [ТС] #19
((( может настройки студии какието??
0
Ketino
8 / 8 / 0
Регистрация: 21.09.2009
Сообщений: 84
12.10.2009, 23:15 #20
Такое впечатление что компилируется не то что ты сюда копировал
0
novi4ok
551 / 504 / 8
Регистрация: 23.07.2009
Сообщений: 2,359
Записей в блоге: 1
13.10.2009, 01:03 #21
а я было увидел, что все завершилось с нулями и думал вопрос решен. ан-нет.

содержимое этого файла полностью приведи:

c:\documents and settings\администратор\мои документы\visual studio 2008\projects\aaa\aaa\source 2.cpp

и сообщи, каке еще файлы в проекте имеются, и что за проект - консольный или еще что?
0
агерон
268 / 267 / 33
Регистрация: 12.10.2009
Сообщений: 1,061
13.10.2009, 03:26 #22
Цитата Сообщение от Pavel1133 Посмотреть сообщение
Программа для возведеня в степень число, я не понимаю в чём проблема

C++
1
2
3
4
5
6
7
8
9
10
11
12
13
14
15
#include <iostream>
using namespace std;
int main();
int j=1; i , N, w;
cout << "vvedite 4islo" << endl;
cin >> i << endl;
w=i;
cout << "vvedite stepen'" << endl;
cin >> N << endl;
while (j<N) {
    i=i*w;
    j++;
}
cout << i << endl;
system("pause");
собственно ошибки тут
И вот ошибки которые я не пойму ((

1>------ Build started: Project: aaa, Configuration: Debug Win32 ------
1>Compiling...
1>Source1.cpp
1>c:\documents and settings\администратор\мои документы\visual studio 2008\projects\aaa\aaa\source1.cpp(4) : error C4430: missing type specifier - int assumed. Note: C++ does not support default-int
1>c:\documents and settings\администратор\мои документы\visual studio 2008\projects\aaa\aaa\source1.cpp(4) : error C4430: missing type specifier - int assumed. Note: C++ does not support default-int
1>c:\documents and settings\администратор\мои документы\visual studio 2008\projects\aaa\aaa\source1.cpp(4) : error C4430: missing type specifier - int assumed. Note: C++ does not support default-int
1>c:\documents and settings\администратор\мои документы\visual studio 2008\projects\aaa\aaa\source1.cpp(5) : error C2143: syntax error : missing ';' before '<<'
1>c:\documents and settings\администратор\мои документы\visual studio 2008\projects\aaa\aaa\source1.cpp(5) : error C4430: missing type specifier - int assumed. Note: C++ does not support default-int
1>c:\documents and settings\администратор\мои документы\visual studio 2008\projects\aaa\aaa\source1.cpp(6) : error C2143: syntax error : missing ';' before '>>'
1>c:\documents and settings\администратор\мои документы\visual studio 2008\projects\aaa\aaa\source1.cpp(6) : error C4430: missing type specifier - int assumed. Note: C++ does not support default-int
1>c:\documents and settings\администратор\мои документы\visual studio 2008\projects\aaa\aaa\source1.cpp(7) : error C4430: missing type specifier - int assumed. Note: C++ does not support default-int
1>c:\documents and settings\администратор\мои документы\visual studio 2008\projects\aaa\aaa\source1.cpp(7) : error C2086: 'int w' : redefinition
1> c:\documents and settings\администратор\мои документы\visual studio 2008\projects\aaa\aaa\source1.cpp(4) : see declaration of 'w'
1>c:\documents and settings\администратор\мои документы\visual studio 2008\projects\aaa\aaa\source1.cpp(8) : error C2143: syntax error : missing ';' before '<<'
1>c:\documents and settings\администратор\мои документы\visual studio 2008\projects\aaa\aaa\source1.cpp(8) : error C4430: missing type specifier - int assumed. Note: C++ does not support default-int
1>c:\documents and settings\администратор\мои документы\visual studio 2008\projects\aaa\aaa\source1.cpp(8) : error C2086: 'int cout' : redefinition
1> c:\documents and settings\администратор\мои документы\visual studio 2008\projects\aaa\aaa\source1.cpp(5) : see declaration of 'cout'
1>c:\documents and settings\администратор\мои документы\visual studio 2008\projects\aaa\aaa\source1.cpp(9) : error C2143: syntax error : missing ';' before '>>'
1>c:\documents and settings\администратор\мои документы\visual studio 2008\projects\aaa\aaa\source1.cpp(9) : error C4430: missing type specifier - int assumed. Note: C++ does not support default-int
1>c:\documents and settings\администратор\мои документы\visual studio 2008\projects\aaa\aaa\source1.cpp(9) : error C2086: 'int cin' : redefinition
1> c:\documents and settings\администратор\мои документы\visual studio 2008\projects\aaa\aaa\source1.cpp(6) : see declaration of 'cin'
1>c:\documents and settings\администратор\мои документы\visual studio 2008\projects\aaa\aaa\source1.cpp(10) : error C2059: syntax error : 'while'
1>c:\documents and settings\администратор\мои документы\visual studio 2008\projects\aaa\aaa\source1.cpp(10) : error C2143: syntax error : missing ';' before '{'
1>c:\documents and settings\администратор\мои документы\visual studio 2008\projects\aaa\aaa\source1.cpp(10) : error C2447: '{' : missing function header (old-style formal list?)
1>c:\documents and settings\администратор\мои документы\visual studio 2008\projects\aaa\aaa\source1.cpp(14) : error C2143: syntax error : missing ';' before '<<'
1>c:\documents and settings\администратор\мои документы\visual studio 2008\projects\aaa\aaa\source1.cpp(14) : error C4430: missing type specifier - int assumed. Note: C++ does not support default-int
1>c:\documents and settings\администратор\мои документы\visual studio 2008\projects\aaa\aaa\source1.cpp(14) : error C2086: 'int cout' : redefinition
1> c:\documents and settings\администратор\мои документы\visual studio 2008\projects\aaa\aaa\source1.cpp(5) : see declaration of 'cout'
1>c:\documents and settings\администратор\мои документы\visual studio 2008\projects\aaa\aaa\source1.cpp(15) : error C4430: missing type specifier - int assumed. Note: C++ does not support default-int
1>c:\documents and settings\администратор\мои документы\visual studio 2008\projects\aaa\aaa\source1.cpp(15) : error C2365: 'system' : redefinition; previous definition was 'function'
1> d:\mvs c++\vc\include\stdlib.h(521) : see declaration of 'system'
1>c:\documents and settings\администратор\мои документы\visual studio 2008\projects\aaa\aaa\source1.cpp(15) : error C2440: 'initializing' : cannot convert from 'const char [6]' to 'int'
1> There is no context in which this conversion is possible
1>Build log was saved at "file://c:\Documents and Settings\Администратор\Мои документы\Visual Studio 2008\Projects\aaa\aaa\Debug\BuildLog.htm"
1>aaa - 24 error(s), 0 warning(s)
========== Build: 0 succeeded, 1 failed, 0 up-to-date, 0 skipped ==========
люди а заюзать функцию pow,powl из math.h не судьба? я уж не говорю о таком простом выражении как exp(a*ln(b)) что равносильно a^b
0
denver
1610 / 279 / 3
Регистрация: 19.09.2009
Сообщений: 701
13.10.2009, 09:30 #23
Цитата Сообщение от агерон Посмотреть сообщение
люди а заюзать функцию pow,powl из math.h не судьба? я уж не говорю о таком простом выражении как exp(a*ln(b)) что равносильно a^b
Человек только начал изучать язык, написал программу и пытается в ней разобраться Не думаю что такие советы целесообразны.
Павел программа рабочая.
Сделай как сказал новичек. Это у тебя уже глюк где-то.
0
агерон
268 / 267 / 33
Регистрация: 12.10.2009
Сообщений: 1,061
14.10.2009, 12:25 #24
Pavel1133, настоятельно тебе советую ознакомиться с функциями обычного С/C++ а потом почитать кое что про базовые алгоритмы решения задач, (не шаблоны а именно базовые алгоритмы обработки данных) к примеру книжки Дж. Рихтера. поверь программисту с 10 летним стажем многое написано и придумано до тебя (что в принципе оставляет простор для творчества но избавляет от рутины изобретения велосипеда)

Denver, не уподобляйся глупцу, программист должен владеть языком а не язык программистом
0
PP
0 / 0 / 0
Регистрация: 14.10.2009
Сообщений: 20
14.10.2009, 19:12 #25
vot tak doljen viglqdet' tvoi kod, poprobui
i posle std::cin>> ne pishi <<endl;!


C++
1
2
3
4
5
6
7
8
9
10
11
12
13
14
15
16
17
18
int main( void )
{   
   
int j=1, i , N, w;
cout << "vvedite 4islo" << endl;
cin >> i  ;
w=i;
cout << "vvedite stepen'" << endl;
cin >> N;
while (j<N) {
    i=i*w;
    j++;
}
cout << i << endl;
 
     
          return 0;
}
Добавлено через 4 минуты
po moemu kod doljen skoree tak viglqdet' : (kstati posle std::cin>> ne nado dopisivat' v konce <<endl

C++
1
2
3
4
5
6
7
8
9
10
11
12
13
14
15
16
17
18
int main( void )
{   
   
int j=1, i , N, w;
cout << "vvedite 4islo" << endl;
cin >> i  ;  
w=i;
cout << "vvedite stepen'" << endl;
cin >> N;
while (j<N) {
    i=i*w;
    j++;
}
cout << i << endl;
 
     
          return 0;
}
0
Ketino
8 / 8 / 0
Регистрация: 21.09.2009
Сообщений: 84
14.10.2009, 19:37 #26
Проблема не в тексте программы - у автора темы что-то с настройками VS2008 - так как код без проблем компилится и выполняется на другом компе.
0
verchy
0 / 0 / 0
Регистрация: 19.02.2009
Сообщений: 19
14.10.2009, 20:17 #27
Вот тебе пожалуйста немного модернизированный твой код )))
работает 100 % ))
C++
1
2
3
4
5
6
7
8
9
10
11
12
13
14
15
16
17
18
19
20
21
22
23
24
25
26
27
#include <iostream>
#include <conio.h>
#include <stdlib.h>
#include <dos.h>
using std::cout ;
using std::endl;
using std::cin;
void main ()
{
int main();
int j=1, i , N, w;
cout << "vvedite 4islo: " ;
cin >> i;
w=i;
cout << "vvedite stepen' : " ;
cin >> N ;
while (j<N)
{
    i=i*w;
    j++;
}
cout << i << endl;
system("pause");
 
 
    
}
а ещё если ты используешь какуе-то функцию типа system("pause"); то для начала необходимо узнать в какой библиотеке эта функция описана!!!
Если у тебя при компилировании выдаст ошибку то вместо #include <iostream> напиши #include <iostream.h>

Добавлено через 10 минут
агерон, а ты попробуй откомпилить и увидишь что проблем нет нет рабочей программы - нет проблем одни ошибки только и всё!!!
0
AnonymC
1173 / 455 / 28
Регистрация: 23.06.2009
Сообщений: 6,340
Завершенные тесты: 1
14.10.2009, 21:49 #28
Цитата Сообщение от Pavel1133 Посмотреть сообщение
int j=1; i , N, w;
1.убери ; и поставь запятую
2.В строке cin >> i << endl; убери << endl
и все работает
0
Pavel1133
3 / 3 / 0
Регистрация: 12.10.2009
Сообщений: 81
15.10.2009, 16:49  [ТС] #29
sps , eto y menia Mv studio ploxo rabotaet , na drygom kompe pashet
0
15.10.2009, 16:49
MoreAnswers
Эксперт
37091 / 29110 / 5898
Регистрация: 17.06.2006
Сообщений: 43,301
15.10.2009, 16:49
Привет! Вот еще темы с ответами:

В чем ошибка? - C++
Программа компиллируется, но после ввода данных возникает непонятная ошибка. Задание: Определить банки, где выгоднее всего покупать и...

В чем ошибка? - C++
Разработать классы для описанных ниже объектов. Включить в класс методы set (…), get (…), show (…). Определить другие методы. Написать...

В чем ошибка ? - C++
Задача такова Составить программу для вычисления высоты треугольника по сторонам a,b.c Мой текст таков #include &lt;stdio.h&gt; ...

в чем ошибка? - C++
Дано целое позитивное число n. Составить алгоритм вычисления суммы В чем ошибка в коде?#include &lt;iostream&gt; #include &lt;conio.h&gt; ...


Искать еще темы с ответами

Или воспользуйтесь поиском по форуму:
29
Ответ Создать тему
Опции темы

КиберФорум - форум программистов, компьютерный форум, программирование
Powered by vBulletin® Version 3.8.9
Copyright ©2000 - 2017, vBulletin Solutions, Inc.
Рейтинг@Mail.ru