Форум программистов, компьютерный форум CyberForum.ru
Наши страницы

С++ для начинающих

Войти
Регистрация
Восстановить пароль
 
Betokuha
32 / 29 / 9
Регистрация: 05.03.2012
Сообщений: 114
#1

Что за error? - C++

24.05.2012, 03:25. Просмотров 276. Ответов 2
Метки нет (Все метки)

После установки Борланд С++ в Вин 7.
Когда открою вот такой ошибку показывает, что делать?
0
Миниатюры
Что за error?  
Надоела реклама? Зарегистрируйтесь и она исчезнет полностью.
Similar
Эксперт
41792 / 34177 / 6122
Регистрация: 12.04.2006
Сообщений: 57,940
24.05.2012, 03:25
Здравствуйте! Я подобрал для вас темы с ответами на вопрос Что за error? (C++):

Исправить ошибку в WxDev-C++: Error with debugging process: GDB Error: error, No source file named main.cpp - C++
Здравствуйте товарищи! Новенький я в си, установил wxDev-C++, скомпилировал, запускаешь - работает, а чтоб пошагово отладка - не...

ERROR что обозначает ошибка - C++
Что обозначает такие ошибки и как их справить ERROR требуется выражение ERROR требуется указать на функцию(Указатель функции) ERROR...

Error LNK1120, error LNK2019, error LNK2028, queue - C++
// свойство класса Parser queue<elem*>* postfix = new queue<elem*>; // строка, из-за которой происходит ошибка ...

Подскажите что за ошибка - error C4430: - C++
#include "iostream" #include "math.h" using namespace std; #define n 5 main() { int A,i,count, p = 1; cout<<"Введите...

winnt.h(5545) : error C2146: что за ошибка ? - C++
c:\program files\microsoft sdks\windows\v6.0a\include\winnt.h(5545) : error C2146: syntax error : missing ';' before identifier...

Что за ошибка(Linker error: Undesined symbol) - C++
Linker error: Undesined symbol proizv (float near*near*, float near*near*, int, float near*near*) in module ... #include<stdio.h> ...

2
Avazart
Нарушитель
Эксперт С++
7232 / 5404 / 293
Регистрация: 10.12.2010
Сообщений: 23,951
Записей в блоге: 17
24.05.2012, 04:19 #2
А ты Builder от администратора пробывал запускать?
1
Betokuha
32 / 29 / 9
Регистрация: 05.03.2012
Сообщений: 114
24.05.2012, 06:50  [ТС] #3
получилось, спасибо!!!
0
MoreAnswers
Эксперт
37091 / 29110 / 5898
Регистрация: 17.06.2006
Сообщений: 43,301
24.05.2012, 06:50
Привет! Вот еще темы с ответами:

Что не так? Accuracy_Uvx.cpp:32:30: error: void value not ignored as it ought to be - C++
Что не так? Accuracy_Uvx.cpp:32:30: error: void value not ignored as it ought to be #include <cstdlib> #include <math.h> ...

Что не так? Search_time_Uvx.cpp:6:1: error: expected initializer before ‘using’ - C++
Что не так? Search_time_Uvx.cpp:6:1: error: expected initializer before ‘using’ #include <stdio.h> #include <math.h> #include...

error LNK2019: ссылка на неразрешенный внешний символ Что это? - C++
Всем доброго вечера что это такое за непонятная ошибка? error LNK2019: ссылка на неразрешенный внешний символ и Ошибка 2 fatal error...

Ошибка в тестовом примере: "Error 1 error C2143: syntax error : missing ';' before 'if'" - C++
#include<iostream> using namespace std; int main(){ int x, a = 0, b = 10; (cin >> x).get(); while (x){ int c = x % 10; ...


Искать еще темы с ответами

Или воспользуйтесь поиском по форуму:
3
Ответ Создать тему
Опции темы

КиберФорум - форум программистов, компьютерный форум, программирование
Powered by vBulletin® Version 3.8.9
Copyright ©2000 - 2017, vBulletin Solutions, Inc.
Рейтинг@Mail.ru