Форум программистов, компьютерный форум CyberForum.ru

Не компилируется программа: значения функции Y(x), суммы S(x) и |Y(x)–S(x)| - C++

Восстановить пароль Регистрация
 
InstInkt
0 / 0 / 0
Регистрация: 07.11.2008
Сообщений: 34
04.10.2012, 20:51     Не компилируется программа: значения функции Y(x), суммы S(x) и |Y(x)–S(x)| #1
Имеется такая задача:
Для каждого x, изменяющегося от a до b с шагом h, найти значения функции Y(x), суммы S(x) и |Y(x)–S(x)| и вывести в виде таблицы. Значения a, b, h и n вводятся с клавиатуры. Так как значение S(x) является рядом разложения функции Y(x), при правильном решении значения S и Y для заданного аргумента x (для тестовых значений исходных данных) должны совпадать в целой части и в первых двух-четырех позициях после десятичной точки.Не компилируется программа: значения функции Y(x), суммы S(x) и |Y(x)–S(x)|

C++
1
2
3
4
5
6
7
8
9
10
11
12
13
14
15
16
17
18
19
20
21
22
23
24
25
26
27
28
29
30
#include <stdio.h>                      
#include <conio.h>
#include <cmath>
 
int main()
{
double a,b,h,x,s,r,y,z;
int n, zn = -1, k;
printf("input a>"); scanf("%lf", &a);
printf("input b>"); scanf("%lf", &b);
printf("input h>"); scanf("%lf", &h);
printf("input n>"); scanf("%d", &n);
x=0;
for (x=0, x<b, x=x+h)
    {
    r=s=1;
                for (k=1, k<=n, k++)
                {   
                r=(zn*r)*((pow(x,2*k+1)/(4*k*k-1)));
                s+=r;
                }
    y=((1+x*x)/2)*(atan(x))-x/2;
    printf ("\n Y(x)= %lf \n",y );
    printf ("\n S(x)= %lf \n",s );
    z=fabs(y-s);
    printf ("\n |Y(x)-S(x)|=%lf \n",z);
    } 
getch();
return 0;
}
При компиляции выдает ошибку:
Кликните здесь для просмотра всего текста

1>------ Build started: Project: t, Configuration: Debug Win32 ------
1> 1.cpp
1> warning C4996: 'scanf': This function or variable may be unsafe. Consider using scanf_s instead. To disable deprecation, use _CRT_SECURE_NO_WARNINGS. See online help for details.
1> see declaration of 'scanf'
1> warning C4996: 'scanf': This function or variable may be unsafe. Consider using scanf_s instead. To disable deprecation, use _CRT_SECURE_NO_WARNINGS. See online help for details.
1> see declaration of 'scanf'
1>d:\iit 181022\2 сессия\кр сиаод\t\t\1.cpp(11): warning C4996: 'scanf': This function or variable may be unsafe. Consider using scanf_s instead. To disable deprecation, use _CRT_SECURE_NO_WARNINGS. See online help for details.
1> see declaration of 'scanf'
1> warning C4996: 'scanf': This function or variable may be unsafe. Consider using scanf_s instead. To disable deprecation, use _CRT_SECURE_NO_WARNINGS. See online help for details.
1> see declaration of 'scanf'
1>d:\iit 181022\2 сессия\кр сиаод\t\t\1.cpp(14): error C2143: syntax error : missing ';' before ')'
1>d:\iit 181022\2 сессия\кр сиаод\t\t\1.cpp(14): error C2143: syntax error : missing ';' before ')'
1>d:\iit 181022\2 сессия\кр сиаод\t\t\1.cpp(17): error C2143: syntax error : missing ';' before ')'
1>d:\iit 181022\2 сессия\кр сиаод\t\t\1.cpp(17): error C2143: syntax error : missing ';' before ')'
========== Build: 0 succeeded, 1 failed, 0 up-to-date, 0 skipped ==========

Cам ничего не смог сделать решил обратится к вам.
Similar
Эксперт
41792 / 34177 / 6122
Регистрация: 12.04.2006
Сообщений: 57,940
04.10.2012, 20:51     Не компилируется программа: значения функции Y(x), суммы S(x) и |Y(x)–S(x)|
Посмотрите здесь:

C++ Для каждого x, изменяющегося от a до b с шагом h, найдите значения функции Y(x), суммы S(x) и |Y(x)-S(x)|
Для заданных значений аргумента Х вычислить значения суммы S и функции Y или Z. Вычисление S произвести с точностью E C++
Программа не считает значения функции C++
C++ Программа для вычисления суммы и произведения элементов массива с использованием функции
Программа вроде компилируется,но значения не выводит C++
После регистрации реклама в сообщениях будет скрыта и будут доступны все возможности форума.
kazak
 Аватар для kazak
3029 / 2350 / 155
Регистрация: 11.03.2009
Сообщений: 5,401
04.10.2012, 20:56     Не компилируется программа: значения функции Y(x), суммы S(x) и |Y(x)–S(x)| #2
Цитата Сообщение от InstInkt Посмотреть сообщение
for (x=0, x<b, x=x+h)
Цитата Сообщение от InstInkt Посмотреть сообщение
for (k=1, k<=n, k++)
for (x=0; x<b; x=x+h)
for (k=1; k<=n; k++)
Luzifer
 Аватар для Luzifer
6 / 6 / 2
Регистрация: 28.06.2010
Сообщений: 85
04.10.2012, 20:56     Не компилируется программа: значения функции Y(x), суммы S(x) и |Y(x)–S(x)| #3
Цитата Сообщение от kazak Посмотреть сообщение
for (x=0; x<b; x=x+h)
for (k=1; k<=n; k++)
Опередил
C++
1
for(;;)
doctor_lecter
 Аватар для doctor_lecter
279 / 152 / 8
Регистрация: 22.09.2012
Сообщений: 283
04.10.2012, 20:58     Не компилируется программа: значения функции Y(x), суммы S(x) и |Y(x)–S(x)| #4
C++
1
for (x=0, x<b, x=x+h)
вместо запятой нужна ;
InstInkt
0 / 0 / 0
Регистрация: 07.11.2008
Сообщений: 34
04.10.2012, 21:16  [ТС]     Не компилируется программа: значения функции Y(x), суммы S(x) и |Y(x)–S(x)| #5
Всем спасибо, работает Но на scanf всеравно ругается, зато компилируется и работает )
Был бы признателен, если бы помогли упорядочить вывод результатов в виде таблицы
Yandex
Объявления
04.10.2012, 21:16     Не компилируется программа: значения функции Y(x), суммы S(x) и |Y(x)–S(x)|
Ответ Создать тему
Опции темы

Текущее время: 00:41. Часовой пояс GMT +3.
КиберФорум - форум программистов, компьютерный форум, программирование
Powered by vBulletin® Version 3.8.9
Copyright ©2000 - 2016, vBulletin Solutions, Inc.
Рейтинг@Mail.ru