Форум программистов, компьютерный форум CyberForum.ru

error: ISO C++ forbids declaration of 'Time' with no type - C++

Восстановить пароль Регистрация
 
Stasito
0 / 0 / 0
Регистрация: 08.12.2011
Сообщений: 25
03.04.2013, 20:21     error: ISO C++ forbids declaration of 'Time' with no type #1
C++
1
2
3
4
5
6
7
8
9
10
11
12
13
14
15
16
17
18
19
20
21
22
23
24
25
26
27
28
29
30
31
32
33
34
35
36
37
38
39
40
41
42
43
44
#ifndef _TIMELL_H
 
#define _TIMELL_H
 
#include <iostream>
#include <string>
#include "Time.h"
 
using namespace std;
//class Time;
    class TimeLL
    {
    private:
        class TimeNode//Nodes with data related to class Time
        {
//          class Time;
        public:
            Time *time;
                TimeNode *next;
        TimeNode *back;
 
        TimeNode();
                 TimeNode(Time *new_time);
                 ~TimeNode();
    };
    TimeNode* head_list;
    TimeNode *tail_list;
    void AddToHead(Time* new_time);
 
    public:
    TimeLL();
    int count;
    //void AddToHead(Time* new_time);
    void AddNew(Time *s1,Time *s2);
    void Del(Time *del_t);
    void DelAll();
    Time* SearchKey(int code,string timeToDel);
    Time* SearchIndex(int place);
    ~TimeLL();
    };
    
 
 
#endif



C++
1
2
3
4
5
6
7
8
9
10
11
12
13
14
15
16
17
18
19
20
21
22
23
24
25
26
27
28
29
#ifndef _TIME_H
 
#define _TIME_H
 
#include <iostream>
#include <string>
#include "Movie.h"
//#include "TimeLL.h"
using namespace std;
 
class Time
{
private:
    string hour;
    Movie* movie;
 
    public:
    Time();
    Time(string t,Movie* m);
    
    int GetMovie(){return movie->GetCode();}
    void SetTime(string c){hour = c;}
    string GetName(){return movie->GetName();}
    string GetTime(){return hour;}
    
    ~Time();
 
};
#endif



g++ -c main.cpp -ansi -pedantic
TimeLL.h:24: error: ISO C++ forbids declaration of 'Time' with no type
TimeLL.h:24: error: expected ';' before '*' token
TimeLL.h:29: error: expected `)' before '*' token
TimeLL.h:34: error: 'Time' has not been declared
TimeLL.h:40: error: 'Time' has not been declared
TimeLL.h:40: error: 'Time' has not been declared
TimeLL.h:41: error: 'Time' has not been declared
TimeLL.h:43: error: ISO C++ forbids declaration of 'Time' with no type
TimeLL.h:43: error: expected ';' before '*' token
TimeLL.h:44: error: ISO C++ forbids declaration of 'Time' with no type
TimeLL.h:44: error: expected ';' before '*' token
Theater.h:32: error: 'Time' has not been declared
Theater.h:33: error: 'Time' has not been declared
make: *** [main.o] Error 1
Similar
Эксперт
41792 / 34177 / 6122
Регистрация: 12.04.2006
Сообщений: 57,940
03.04.2013, 20:21     error: ISO C++ forbids declaration of 'Time' with no type
Посмотрите здесь:

ISO C++ forbids comparison between pointer and integer| C++
C++ Ошибка: forbids declaration of 'magic' with no type expected ';' before '.' token
14 ISO C++ forbids comparison between pointer and integer C++
C++ [C++ Error] Unit1.cpp(6): E2141 Declaration syntax error
ISO C++ forbids. error C++
После регистрации реклама в сообщениях будет скрыта и будут доступны все возможности форума.
go
Эксперт C++
3582 / 1362 / 128
Регистрация: 16.04.2009
Сообщений: 4,528
03.04.2013, 20:31     error: ISO C++ forbids declaration of 'Time' with no type #2
Stasito, а .cpp файлы линкуете?
Stasito
0 / 0 / 0
Регистрация: 08.12.2011
Сообщений: 25
03.04.2013, 20:40  [ТС]     error: ISO C++ forbids declaration of 'Time' with no type #3
Цитата Сообщение от go Посмотреть сообщение
Stasito, а .cpp файлы линкуете?

конечно, через makefile

Добавлено через 1 минуту
in Visual Studio it works well,but when i compile in g++ i got this error

Добавлено через 2 минуты
and why in line 18 "*time" is in blue color?! hm
go
Эксперт C++
3582 / 1362 / 128
Регистрация: 16.04.2009
Сообщений: 4,528
03.04.2013, 20:45     error: ISO C++ forbids declaration of 'Time' with no type #4
Цитата Сообщение от Stasito Посмотреть сообщение
and why in line 18 "*time" is in blue color?! hm
Есть функция такая. Попробуйте изменить идентификатор.
Stasito
0 / 0 / 0
Регистрация: 08.12.2011
Сообщений: 25
03.04.2013, 21:47  [ТС]     error: ISO C++ forbids declaration of 'Time' with no type #5
Цитата Сообщение от go Посмотреть сообщение
Есть функция такая. Попробуйте изменить идентификатор.
really,I created file Time.h and it is already exists in compiler library...that was a problem
Ichanged the name of header file Time and it works good
Thank you Go
Yandex
Объявления
03.04.2013, 21:47     error: ISO C++ forbids declaration of 'Time' with no type
Ответ Создать тему
Опции темы

Текущее время: 07:46. Часовой пояс GMT +3.
КиберФорум - форум программистов, компьютерный форум, программирование
Powered by vBulletin® Version 3.8.9
Copyright ©2000 - 2016, vBulletin Solutions, Inc.
Рейтинг@Mail.ru