Форум программистов, компьютерный форум, киберфорум
Наши страницы

С++ для начинающих

Войти
Регистрация
Восстановить пароль
 
Rumsky
0 / 0 / 0
Регистрация: 15.03.2013
Сообщений: 8
#1

Что не так? Search_time_Uvx.cpp:6:1: error: expected initializer before ‘using’ - C++

01.05.2013, 17:56. Просмотров 1076. Ответов 2
Метки нет (Все метки)

Что не так?
Search_time_Uvx.cpp:6:1: error: expected initializer before ‘using’

C++
1
2
3
4
5
6
7
8
9
10
11
12
13
14
15
16
17
18
19
20
21
22
#include <stdio.h>
#include <math.h>
 
#include "Wheres_Your_Head_At.h"
 
using namespace std;
 
void Search_time_Uvx()
 
{
 
    float  vrem1,vrem2,Uvx;
   printf("Search time ... <Enter value of Uvx>");
   scanf("%f", &Uvx);
   
    
    vrem1=sqrt(log(10/Uvx))/1.5;
    vrem2=-(sqrt(log(10/Uvx))/1.5);
   
    printf("vrem1=%6.4f  vrem2=%6.4f\n", vrem1,vrem2);
 
}
0
Надоела реклама? Зарегистрируйтесь и она исчезнет полностью.
Similar
Эксперт
41792 / 34177 / 6122
Регистрация: 12.04.2006
Сообщений: 57,940
01.05.2013, 17:56
Здравствуйте! Я подобрал для вас темы с ответами на вопрос Что не так? Search_time_Uvx.cpp:6:1: error: expected initializer before ‘using’ (C++):

Как исправить [Error] expected initializer before 'bool'? - C++
#include &lt;string.h&gt; #include &lt;cstring&gt; int main() bool exists = false; for (int i = 0; i &lt; strlen(str)-1 &amp;&amp; !exists; i++) ...

Error: expected initializer before 'ip2str' при компиляции приложения - C++
Всем привет. Помогите разобраться. При компиляции файла выдает ошибку files.cpp:204: error: expected initializer before 'ip2str' ...

Что не так? Accuracy_Uvx.cpp:32:30: error: void value not ignored as it ought to be - C++
Что не так? Accuracy_Uvx.cpp:32:30: error: void value not ignored as it ought to be #include &lt;cstdlib&gt; #include &lt;math.h&gt; ...

Ошибка: expected initializer before 'void' - C++
Выдает ошибку expected initializer before 'void', помогите исправить #include &lt;iostream&gt; using namespace std; int a;...

Исправить ошибку в WxDev-C++: Error with debugging process: GDB Error: error, No source file named main.cpp - C++
Здравствуйте товарищи! Новенький я в си, установил wxDev-C++, скомпилировал, запускаешь - работает, а чтоб пошагово отладка - не...

Как изменить код, чтобы не было ошибки "expected initializer before void" - C++
В общем, компилятор почему-то ругается на 3 строку, говоря &quot;expected initializer before void&quot; Что ему тут не нравится -- ума не приложу....

2
Kastaneda
Jesus loves me
Эксперт С++
4689 / 2893 / 236
Регистрация: 12.12.2009
Сообщений: 7,356
Записей в блоге: 2
Завершенные тесты: 1
01.05.2013, 18:02 #2
проблема в файле Wheres_Your_Head_At.h.
1
Rumsky
0 / 0 / 0
Регистрация: 15.03.2013
Сообщений: 8
01.05.2013, 18:05  [ТС] #3
Цитата Сообщение от Kastaneda Посмотреть сообщение
проблема в файле Wheres_Your_Head_At.h.
Блин) Я слепой=Р ";" забыл)
0
MoreAnswers
Эксперт
37091 / 29110 / 5898
Регистрация: 17.06.2006
Сообщений: 43,301
01.05.2013, 18:05
Привет! Вот еще темы с ответами:

C:\tsserver\Projects\cpp\codeblocks\MyComp\compiler\mmz\mmz. cpp|29|error: no match for 'operator=' in '* Item = * Source'| - C++
char **Source; TArray&lt;std::string&gt; *Item; ... *Item=*Source;

Ошибка: error: cannot convert '<brace-enclosed initializer list>' to 'int - C++
всем привет! не могу разобраться, что это за ошибка void sum_element() { const int size = 10; int arr = {0}; int...

[C++ Error] Sqrt x.cpp(16): E2268 Call to undefined function 'sqrt'. Что это за ошибка??? - C++
Когда я испльзую функцию sqrt() компилятор выводит: Sqrt x.cpp(16): E2268 Call to undefined function 'sqrt' Что это значит???

C:\Dev-Cpp\Makefile.win [Build Error] [Безымянный1.o] Error 1 - C++
C:\Dev-Cpp\Makefile.win Error 1 компилятор стал показывать такую ошибку, после того как я открыл эту папку редактором и удалил от...


Искать еще темы с ответами

Или воспользуйтесь поиском по форуму:
3
Ответ Создать тему
Опции темы

КиберФорум - форум программистов, компьютерный форум, программирование
Powered by vBulletin® Version 3.8.9
Copyright ©2000 - 2017, vBulletin Solutions, Inc.
Рейтинг@Mail.ru