Форум программистов, компьютерный форум CyberForum.ru

С++ для начинающих

Войти
Регистрация
Восстановить пароль
 
Рейтинг: Рейтинг темы: голосов - 22, средняя оценка - 4.91
goshix
0 / 0 / 0
Регистрация: 31.07.2013
Сообщений: 3
#1

Borland C++ error 1309 - C++

11.08.2013, 23:55. Просмотров 3240. Ответов 5
Метки нет (Все метки)

Всем привет.
Я тут хочу загрузить Borland, но у меня все время выскакивает ошибка 1309. Добавлял файл uninstall.ini куда просят, но потом появляются новые категории где его нет (Temp7 потом Temp8 и т.д.). Что делать? Как решить проблему?
Миниатюры
Borland C++ error 1309  
Similar
Эксперт
41792 / 34177 / 6122
Регистрация: 12.04.2006
Сообщений: 57,940
11.08.2013, 23:55     Borland C++ error 1309
Посмотрите здесь:

ошибка [Linker Error] Unresolved external '_main' referenced from C:\PROGRAM FILES\BORLAND\CBUILDER6\LIB\C0X32.OBJ - C++
При компиляции программы борланд выдает ошибку Unresolved external '_main' referenced from C:\PROGRAM...

[Linker Error] Unresolved external '_main' referenced from C:\PROGRAM FILES (X86)\BORLAND\CBUILDER6\LIB\C0X32.OBJ - C++
незнаю куда функцию main() #include <cstring> #define BASE 10 //ñèñòåìà ñ÷èñëåíèÿ #define MIN_LENGTH_FOR_KARATSUBA 4 //÷èñëà...

Project : error PRJ0003 : Error spawning 'rc.exe - C++
1>Project : error PRJ0003 : Error spawning 'rc.exe'. помогите что за ошибка?

build error [xxx.exe] error 1 - C++
Почему после компиляции dev-cpp выдает такую ошибку: D:\*****\Makefile.win Error 1 При компиляции в visual с все в порядке ...

Error C2143: syntax error : missing ';' before '.' - C++
#include <fstream> #include <iostream> using std::cin; using std::cout; using std::endl; using std::ifstream; using...

Error C2059: syntax error : 'constant' - C++
Подскажите пожалуйста почему выдает ошибку error C2059: syntax error : 'constant' в этой строке : const int OK=0, EOS=0, ERROR=0; ...

Ошибка в Dev-C++ : Build Error Error 1 - C++
Ошибка в Dev-C++ : Build Error Error 1 Вод сам код: #include <iostream> #include <stdlib.h> using namespace std; ...

Ошибка: error: 'error' was not declared in this scope - C++
#include <iostream> #include<vector> using namespace std; int area(int a,int b) { if(a<=0 || b<=0) error("area()...

Error E2141 Declaration syntax error - C++
#include<stdlib.h> #include<conio.h> #include<stdio.h> #include<cmath.h> #include<stdlib.h> #include<time.h> ...

[ILINK32 Error] Error: Unresolved external - C++
помогите вылетает ошибка и программа из-за этого не работает! Error: Unresolved external '__fastcall...

Error C2061: syntax error : identifier 'h' - C++
в чем ошибка? error C2061: syntax error : identifier 'h' #include "stdafx.h" #include "stdio.h" #include "conio.h" #include...

Error C2106 или error C2440 - C++
Необходимо создать односвязный список из слов строки.Ошибка в 28 и 35 строке. Код: #include "stdafx.h" #include <conio.h> #include...


Искать еще темы с ответами

Или воспользуйтесь поиском по форуму:
После регистрации реклама в сообщениях будет скрыта и будут доступны все возможности форума.
Kuzia domovenok
1890 / 1745 / 118
Регистрация: 25.03.2012
Сообщений: 5,924
Записей в блоге: 1
11.08.2013, 23:58     Borland C++ error 1309 #2
Borland не нужен.
goshix
0 / 0 / 0
Регистрация: 31.07.2013
Сообщений: 3
12.08.2013, 00:01  [ТС]     Borland C++ error 1309 #3
долго объяснять, но мне как раз он нужен)
AntonChik
1084 / 582 / 21
Регистрация: 11.11.2008
Сообщений: 1,544
12.08.2013, 12:55     Borland C++ error 1309 #4
запускаете setup.exe? с правами админа?
White Tiger
0 / 0 / 0
Регистрация: 12.02.2012
Сообщений: 40
12.01.2017, 09:45     Borland C++ error 1309 #5
да.
Fulcrum_013
663 / 731 / 72
Регистрация: 14.12.2014
Сообщений: 5,699
Завершенные тесты: 3
12.01.2017, 10:00     Borland C++ error 1309 #6
Цитата Сообщение от goshix Посмотреть сообщение
Я тут хочу загрузить Borland, но у меня все время выскакивает ошибка 1309. Добавлял файл uninstall.ini куда просят, но потом появляются новые категории где его нет (Temp7 потом Temp8 и т.д.). Что делать? Как решить проблему?
Ось какая? У меня все что ниже 2010 -ой под Win10 работать отказалась. Проблема по видимому в том что не ставится под незнакомые оси. По всей видимости стоит взять версию поновее.
Yandex
Объявления
12.01.2017, 10:00     Borland C++ error 1309
Ответ Создать тему
Опции темы

КиберФорум - форум программистов, компьютерный форум, программирование
Powered by vBulletin® Version 3.8.9
Copyright ©2000 - 2017, vBulletin Solutions, Inc.
Рейтинг@Mail.ru