Форум программистов, компьютерный форум CyberForum.ru

error C4430 people - C++

Восстановить пароль Регистрация
 
Martial
0 / 0 / 0
Регистрация: 15.09.2013
Сообщений: 10
15.09.2013, 18:49     error C4430 people #1
C++
1
2
3
4
5
6
7
8
9
10
11
12
13
14
15
16
17
18
19
20
#include <stdio.h> 
#include <math.h>
#define pi 3.1415927
main () 
{
double r,h,l,s,v,sbok,spoln;
printf("Vvedite radius konysa : ");
scanf("%f",&r);
printf("Vvedite dliny rebra : ");
scanf("%f",&l);
printf("VVedite visoty konysa : ");
scanf("%f",&h);
s=pi*(r*r);
sbok=pi*r*l;
spoln=sbok+s;
v=(s*h)/3;
printf("Ploshad` bokovoi poverhnosti : %f\n", sbok);
printf("Ploshad` polnoi poverhnosti : %f\n", spoln);
printf("Ob`em konusa: %f\n" , v);
}

выбивает вот такую штуку :
Код
1>------ Build started: Project: laba1, Configuration: Debug Win32 ------
1>Compiling...
1>ant.cpp
1>c:\users\user\documents\visual studio 2008\projects\laba1\laba1\ant.cpp(6) : error C4430: missing type specifier - int assumed. Note: C++ does not support default-int
1>Build log was saved at "file://c:\Users\User\Documents\Visual Studio 2008\Projects\laba1\laba1\Debug\BuildLog.htm"
1>laba1 - 1 error(s), 0 warning(s)
========== Build: 0 succeeded, 1 failed, 0 up-to-date, 0 skipped ==========
Ребят помогите пожалуйста.. Программирую третий день..
После регистрации реклама в сообщениях будет скрыта и будут доступны все возможности форума.
ViktorKozlov
133 / 125 / 2
Регистрация: 13.12.2012
Сообщений: 293
15.09.2013, 18:51     error C4430 people #2
C++
1
int main ()
Martial
0 / 0 / 0
Регистрация: 15.09.2013
Сообщений: 10
15.09.2013, 19:13  [ТС]     error C4430 people #3
Код
1>------ Build started: Project: laba1, Configuration: Debug Win32 ------
1>Compiling...
1>ant.cpp
1>c:\users\user\documents\visual studio 2008\projects\laba1\laba1\ant.cpp(9) : warning C4996: 'scanf': This function or variable may be unsafe. Consider using scanf_s instead. To disable deprecation, use _CRT_SECURE_NO_WARNINGS. See online help for details.
1>        c:\program files (x86)\microsoft visual studio 9.0\vc\include\stdio.h(306) : see declaration of 'scanf'
1>c:\users\user\documents\visual studio 2008\projects\laba1\laba1\ant.cpp(11) : warning C4996: 'scanf': This function or variable may be unsafe. Consider using scanf_s instead. To disable deprecation, use _CRT_SECURE_NO_WARNINGS. See online help for details.
1>        c:\program files (x86)\microsoft visual studio 9.0\vc\include\stdio.h(306) : see declaration of 'scanf'
1>c:\users\user\documents\visual studio 2008\projects\laba1\laba1\ant.cpp(13) : warning C4996: 'scanf': This function or variable may be unsafe. Consider using scanf_s instead. To disable deprecation, use _CRT_SECURE_NO_WARNINGS. See online help for details.
1>        c:\program files (x86)\microsoft visual studio 9.0\vc\include\stdio.h(306) : see declaration of 'scanf'
1>Compiling manifest to resources...
1>Project : error PRJ0003 : Error spawning 'rc.exe'.
1>Build log was saved at "file://c:\Users\User\Documents\Visual Studio 2008\Projects\laba1\laba1\Debug\BuildLog.htm"
1>laba1 - 1 error(s), 3 warning(s)
========== Build: 0 succeeded, 1 failed, 0 up-to-date, 0 skipped ==========
вот что стало(

Добавлено через 18 минут
ViktorKozlov, ау?((

Добавлено через 29 секунд
ViktorKozlov, ау?((
alex_x_x
бжни
 Аватар для alex_x_x
2441 / 1646 / 84
Регистрация: 14.05.2009
Сообщений: 7,163
15.09.2013, 19:16     error C4430 people #4
http://social.msdn.microsoft.com/For...spawning-rcexe

както криво студия/runtime tools установлены
Martial
0 / 0 / 0
Регистрация: 15.09.2013
Сообщений: 10
15.09.2013, 19:26  [ТС]     error C4430 people #5
C++
1
2
3
4
5
6
7
8
9
10
11
12
13
14
15
16
17
18
19
20
#include <math.h>
#define pi 3.1415927
int  main () 
{
double r,h,l,s,v,sbok,spoln,pi;
 
printf("Vvedite radius konysa : ");
scanf("%f",&r);
printf("Vvedite dliny rebra : ");
scanf("%f",&l);
printf("VVedite visoty konysa : ");
scanf("%f",&h);
s=pi*(r*r);
sbok=pi*r*l;
spoln=sbok+s;
v=(s*h)/3;
printf("Ploshad` bokovoi poverhnosti : %f\n", sbok);
printf("Ploshad` polnoi poverhnosti : %f\n", spoln);
printf("Ob`em konusa: %f\n" , v);
}
Немного изменил вот что стало
Код
1>Compiling...
1>ant.cpp
1>c:\users\user\documents\visual studio 2008\projects\laba1\laba1\ant.cpp(7) : error C2059: syntax error : 'constant'
1>Build log was saved at "file://c:\Users\User\Documents\Visual Studio 2008\Projects\laba1\laba1\Debug\BuildLog.htm"
1>laba1 - 1 error(s), 0 warning(s)
========== Build: 0 succeeded, 1 failed, 0 up-to-date, 0 skipped ==========
Yandex
Объявления
15.09.2013, 19:26     error C4430 people
Ответ Создать тему
Опции темы

Текущее время: 12:39. Часовой пояс GMT +3.
КиберФорум - форум программистов, компьютерный форум, программирование
Powered by vBulletin® Version 3.8.9
Copyright ©2000 - 2016, vBulletin Solutions, Inc.
Рейтинг@Mail.ru