Форум программистов, компьютерный форум CyberForum.ru

С++ для начинающих

Войти
Регистрация
Восстановить пароль
 
Workout111
0 / 0 / 0
Регистрация: 15.11.2012
Сообщений: 10
#1

Подскажите в чем тут ошибка, не идет компиляция - C++

17.09.2013, 22:24. Просмотров 327. Ответов 5
Метки нет (Все метки)

C++
1
2
3
4
5
6
7
8
9
10
11
12
13
14
15
16
17
18
19
20
21
22
#include "stdafx.h"
#include <iostream>
#include <math.h>
using namespace std;
 
void main()
{cout<< "Hello, student"<<end;
double a,b,x,y ;
cout<<"vvedi a,b"<<end;
cin>>a>>b ;
cout<<"a=" <<a<< "\t b=" <<b<<end;
cout<<end;
cout<<"pri a=1.1 i b=3.3"<<end;
cout<<end ;
x=sin(a+b) ;
y=a+b ;
cout<<"   x=" <<x<<end;
cout<<end;
cout<<"   y=" <<y<<end;
cout<<end;
cout<<"2/3="<<2/3.<<end;
}

Пишет вот такую вот ошибку:
Код
1>c:\users\сеня\documents\visual studio 2008\projects\lab11\lab11\lab11.cpp(10) : error C2065: end: необъявленный идентификатор
1>c:\users\сеня\documents\visual studio 2008\projects\lab11\lab11\lab11.cpp(12) : error C2065: end: необъявленный идентификатор
1>c:\users\сеня\documents\visual studio 2008\projects\lab11\lab11\lab11.cpp(14) : error C2065: end: необъявленный идентификатор
1>c:\users\сеня\documents\visual studio 2008\projects\lab11\lab11\lab11.cpp(15) : error C2065: end: необъявленный идентификатор
1>c:\users\сеня\documents\visual studio 2008\projects\lab11\lab11\lab11.cpp(16) : error C2065: end: необъявленный идентификатор
1>c:\users\сеня\documents\visual studio 2008\projects\lab11\lab11\lab11.cpp(17) : error C2065: end: необъявленный идентификатор
1>c:\users\сеня\documents\visual studio 2008\projects\lab11\lab11\lab11.cpp(20) : error C2065: end: необъявленный идентификатор
1>c:\users\сеня\documents\visual studio 2008\projects\lab11\lab11\lab11.cpp(21) : error C2065: end: необъявленный идентификатор
1>c:\users\сеня\documents\visual studio 2008\projects\lab11\lab11\lab11.cpp(22) : error C2065: end: необъявленный идентификатор
1>c:\users\сеня\documents\visual studio 2008\projects\lab11\lab11\lab11.cpp(23) : error C2065: end: необъявленный идентификатор
1>c:\users\сеня\documents\visual studio 2008\projects\lab11\lab11\lab11.cpp(24) : error C2065: end: необъявленный идентификатор
Similar
Эксперт
41792 / 34177 / 6122
Регистрация: 12.04.2006
Сообщений: 57,940
17.09.2013, 22:24     Подскажите в чем тут ошибка, не идет компиляция
Посмотрите здесь:

Подскажите в чем тут ошибка - C++
#include &quot;stdafx.h&quot; #include &lt;iostream&gt; #include &lt;math.h&gt; using namespace std; void main() {cout&lt;&lt; &quot;Hello, student&quot;&lt;&lt;endl; ...

Подскажите пожалуйста, я тут новенький в чем ошибка? - C++
&quot;int main (void){int х, *р; х = 10; *р = х;return 0;}&quot; Я долгое время не как не пойму... У казатель &quot;р&quot; не получает адреса, как мне...

Где тут ошибка, подскажите плз! - C++
#include &quot;stdafx.h&quot; #include &lt;windows.h&gt; #include &lt;iostream&gt; using namespace std; void main() { SetConsoleOutputCP(1251); ...

Подскажите, в чем ошибка? - C++
Вроде все правильно, почему выходит результат &quot;Вы не сдали&quot;? #include &lt;iostream&gt; #include &lt;Windows.h&gt; #include &lt;conio.h&gt; using...

Подскажите в чем ошибка - C++
Нужно создать файл 5.дат и записать в него информацию с структуры аерофлот. Создаю я вот так: #include &lt;iostream&gt; #include &lt;stdio.h&gt; ...

Подскажите в чем ошибка - C++
Есть код: #include &lt;iostream&gt; #include &lt;vector&gt; using namespace std; int main() { vector&lt;int&gt;vec; vector&lt;int&gt;::iterator...

Подскажите, в чем ошибка - C++
При компиляции программы компилятор выдает сообщение: undefined reference to `imput(int)' ld returned 1 exit status ...

подскажите в чем ошибка - C++
поставлена задача: Задан одномерный массив В, состоящем из n вещественных элементов. Определить позиции массива, в которых расположены...

подскажите в чем ошибка - C++
только сегодня начал знакомство и вот уже проблемка)подскажите пожалуйста в чем ошибка)) Две дроби a/b и c/d можно сложить следующим...

Подскажите, в чем ошибка - C++
#include&lt;stdio.h&gt; #include&lt;cmath&gt; using namespace std; int main() { int n,a,b,c,d,t; cin&gt;&gt;n; a=9*60; ...

Подскажите, в чем ошибка? - C++
,,,

Подскажите в чем ошибка - C++
Не могу понять в чем ошибка #include &lt;iostream&gt; #include &lt;math.h&gt; #include &lt;stdio.h&gt; #include &lt;conio.h&gt; using namespace...


Искать еще темы с ответами

Или воспользуйтесь поиском по форуму:
После регистрации реклама в сообщениях будет скрыта и будут доступны все возможности форума.
SummerRain
326 / 325 / 17
Регистрация: 16.12.2012
Сообщений: 544
17.09.2013, 22:25     Подскажите в чем тут ошибка, не идет компиляция #2
endl
ВАСИЛЕВС
555 / 478 / 60
Регистрация: 14.02.2012
Сообщений: 1,561
17.09.2013, 22:26     Подскажите в чем тут ошибка, не идет компиляция #3
"endl" вместо "end".
Workout111
0 / 0 / 0
Регистрация: 15.11.2012
Сообщений: 10
17.09.2013, 22:28  [ТС]     Подскажите в чем тут ошибка, не идет компиляция #4
"endI" в конце это английская I?
SummerRain
326 / 325 / 17
Регистрация: 16.12.2012
Сообщений: 544
17.09.2013, 22:29     Подскажите в чем тут ошибка, не идет компиляция #5
endl -> L
end line
ВАСИЛЕВС
555 / 478 / 60
Регистрация: 14.02.2012
Сообщений: 1,561
17.09.2013, 22:30     Подскажите в чем тут ошибка, не идет компиляция #6
L в нижнем регистре.
Yandex
Объявления
17.09.2013, 22:30     Подскажите в чем тут ошибка, не идет компиляция
Ответ Создать тему
Опции темы

КиберФорум - форум программистов, компьютерный форум, программирование
Powered by vBulletin® Version 3.8.9
Copyright ©2000 - 2017, vBulletin Solutions, Inc.
Рейтинг@Mail.ru