Форум программистов, компьютерный форум CyberForum.ru

Почему не видит класс - C++

Восстановить пароль Регистрация
 
DrMGC
 Аватар для DrMGC
0 / 0 / 0
Регистрация: 19.04.2013
Сообщений: 83
07.10.2013, 15:13     Почему не видит класс #1
Уже второй день немогу понять в чем проблема

Exception.hpp
C++
1
2
3
4
5
6
7
8
9
10
11
12
13
14
15
16
17
18
#include "IThrowable.hpp"
#include "../../Object.hpp"
#include "../struct/String.hpp"
 
class Exception : public Object, IThorwable {
public:
    Exception(const String _message);
    Exception();
    virtual ~Exception();
 
    const String getMsg() const;
    const longtime_t getTime() const;
    void onThrow();
protected:
    String __msg;
private:
    longtime_t ___time;
};
arrayExcepitions.hpp
C++
1
2
3
4
5
6
#include "../exceptions/Exception.hpp"
 
class ArrayException : public Exception {
public:
    virtual ~ArrayException();
};
Ошибка
c++ -DPLATFORM_=linux -DCAPACITY_=32 -std=c++11 -fPIC -o obj/core_Exception.cpp.o -c src/Core/defaultTypes/exceptions/Exception.cpp
In file included from src/Core/defaultTypes/exceptions/Exception.cpp:23:
In file included from src/Core/defaultTypes/exceptions/Exception.hpp:26:
In file included from src/Core/defaultTypes/exceptions/IThrowable.hpp:27:
In file included from src/Core/defaultTypes/exceptions/../struct/String.hpp:28:
In file included from src/Core/defaultTypes/exceptions/../struct/Array.hpp:29:
src/Core/defaultTypes/exceptions/../struct/arrayExceptions.hpp:29:31: error: expected class name
class ArrayException : public Exception {
^
1 error generated.
make: *** [core_Exception.cpp.o] Ошибка 1
PS В g++ ощибка с той же сутью
После регистрации реклама в сообщениях будет скрыта и будут доступны все возможности форума.
Croessmah
Модератор
Эксперт С++
 Аватар для Croessmah
11832 / 6811 / 769
Регистрация: 27.09.2012
Сообщений: 16,885
Записей в блоге: 2
Завершенные тесты: 1
07.10.2013, 15:16     Почему не видит класс #2
Ну можно предположить, что
#include "IThrowable.hpp"
//...
class Exception : public Object, IThorwable {
DrMGC
 Аватар для DrMGC
0 / 0 / 0
Регистрация: 19.04.2013
Сообщений: 83
07.10.2013, 15:17  [ТС]     Почему не видит класс #3
Цитата Сообщение от Croessmah Посмотреть сообщение
Ну можно предположить, что
Класс так и назывался (уже поправил), но ошибка всё таже
VEINHORN
542 / 91 / 22
Регистрация: 16.12.2011
Сообщений: 317
07.10.2013, 16:25     Почему не видит класс #4
После небольшого преобразования все компилится. Ищите ошибку внутри реализации своих классов или же больше кода сюда выложите чтобы можно было понять наверняка в чем проблема.

C++
1
2
3
4
5
6
7
8
9
10
11
12
13
14
15
16
17
18
19
20
21
22
23
24
25
26
27
28
29
30
31
32
33
34
35
36
37
38
39
40
#include <iostream>
using namespace std;
 
class Object {
 
};
 
class IOThrowable {
 
};
 
class String {
 
};
 
class Exception : public Object, IOThrowable {
public:
    Exception(const String _message);
    Exception();
    virtual ~Exception();
 
    const String getMsg() const;
    const int getTime() const;
    void onThrow();
protected:
    String __msg;
private:
    int ___time;
};
 
class ArrayException : public Exception {
public:
    virtual ~ArrayException();
};
 
int main() {
 
    system("pause");
    return 0;
}
DrMGC
 Аватар для DrMGC
0 / 0 / 0
Регистрация: 19.04.2013
Сообщений: 83
07.10.2013, 18:41  [ТС]     Почему не видит класс #5
MCKLAS,
1. это либа (shared)
2. раньее также было (в этом же файле), но реализация и Exception и остольного (IThrowable, Object) была другая (отсутствовала)
DrMGC
 Аватар для DrMGC
0 / 0 / 0
Регистрация: 19.04.2013
Сообщений: 83
08.10.2013, 13:36  [ТС]     Почему не видит класс #6
MCKLAS, после рефракторинга (переложил файлы и убрал из ArrayException декстуркутор за ненадобностью). Теперьв вот такой вывод:
c++ -DPLATFORM_=linux -DCAPACITY_=32 -std=c++11 -fPIC -o obj/core_Exception.cpp.o -c src_Core/Exception.cpp
In file included from src_Core/Exception.cpp:23:
In file included from src_Core/Exception.hpp:26:
In file included from src_Core/IThrowable.hpp:27:
In file included from src_Core/String.hpp:28:
src_Core/Array.hpp:31:31: error: unknown class name 'Exception'; did you mean 'std::exception'?
class ArrayException : public Exception {};
___________________^~~~~~~~~
___________________std::exception
/usr/bin/../lib/gcc/i686-linux-gnu/4.7/../../../../include/c++/4.7/exception:61:9: note: 'std::exception' declared here
class exception
____^
1 error generated.
make: *** [core_Exception.cpp.o] Ошибка 1
PS пробелы в выоде заменил на '_', ибо форум не даёт их оставить
Yandex
Объявления
08.10.2013, 13:36     Почему не видит класс
Ответ Создать тему
Опции темы

Текущее время: 12:53. Часовой пояс GMT +3.
КиберФорум - форум программистов, компьютерный форум, программирование
Powered by vBulletin® Version 3.8.9
Copyright ©2000 - 2016, vBulletin Solutions, Inc.
Рейтинг@Mail.ru