Форум программистов, компьютерный форум CyberForum.ru

C++

Войти
Регистрация
Восстановить пароль
 
florgas
5 / 4 / 0
Регистрация: 28.09.2010
Сообщений: 339
#1

Не компилируются программы: Отсутствует обязательный файл "" - C++

23.10.2012, 22:01. Просмотров 734. Ответов 3
Метки нет (Все метки)

Не компилируются программы на MVS 2010.

Создаю пустой консольный проект - не компилируется, создаю любой другой проект - тоже не компилируется.
1>------ Построение начато: проект: Ya_Defigod, Конфигурация: Debug Win32 ------
1>C:\Program Files (x86)\MSBuild\Microsoft.Cpp\v4.0\Microsoft.CppCommon.targets(707,5): error : Отсутствует обязательный файл "".
========== Построение: успешно: 0, с ошибками: 1, без изменений: 0, пропущено: 0 ==========
Скачал новый VS. Установил - другая ошибка:

1>------ Build started: Project: DefigodTest, Configuration: Debug Win32 ------
1>Build started 23.10.2012 21:47:12.
1>PrepareForBuild:
1> Creating directory "c:\my dоcuments\visual studio 2010\Projects\DefigodTest\Debug\".
1>InitializeBuildStatus:
1> Creating "Debug\DefigodTest.unsuccessfulbuild" because "AlwaysCreate" was specified.
1>LINK : error LNK2001: неразрешенный внешний символ "_mainCRTStartup"
1>c:\my dоcuments\visual studio 2010\Projects\DefigodTest\Debug\DefigodTest.exe : fatal error LNK1120: 1 неразрешенных внешних элементов
1>
1>Build FAILED.
1>
1>Time Elapsed 00:00:02.60
========== Build: 0 succeeded, 1 failed, 0 up-to-date, 0 skipped ==========
Что делать? С++ нужен срочно! =(
Similar
Эксперт
41792 / 34177 / 6122
Регистрация: 12.04.2006
Сообщений: 57,940
23.10.2012, 22:01     Не компилируются программы: Отсутствует обязательный файл ""
Посмотрите здесь:

"Не удаётся найти указанный файл" после запуска программы Visual C++
ошибка: отсутствует обязательный файл "" C++
Microsoft Visual C++ 2010 Express - не компилируются приложения. Ошибка "Не удаётся найти файл" C++
Visual C++ Отсутствует "Проект Win32" в VS2012 под Win8
Не линкуется импортированный проект, отсутствует "CHART.OBJ" C++ Builder
Ошибка: отсутствует оператор "<<", соответствующий этим операндам C++
Ошибка: "C4430 отсутствует спецификатор типа - предполагается int..." C++
Не компилируется, ошибки: "отсутствует оператор, соответствующий этим операндам" C++
Ошибка: отсутствует оператор "==", соответствующий этим операндам C++
C++ MinGW после обновления выдает ошибку "отсутствует libgcc_s_dw2-1.dll"
C++ "Отсутствует оператор >> соответствующий этим операндам" - в чем ошибка?
C++ От класса "Файл" унаследовать класс "Зашифрованный файл"

Искать еще темы с ответами

Или воспользуйтесь поиском по форуму:
После регистрации реклама в сообщениях будет скрыта и будут доступны все возможности форума.
CheshireCat
Эксперт С++
2891 / 1240 / 78
Регистрация: 27.05.2008
Сообщений: 3,327
24.10.2012, 11:47     Не компилируются программы: Отсутствует обязательный файл "" #2
Какие программы-то? Где код? Телепаты все в отпуске :-)
florgas
5 / 4 / 0
Регистрация: 28.09.2010
Сообщений: 339
24.10.2012, 16:57  [ТС]     Не компилируются программы: Отсутствует обязательный файл "" #3
Какой код? Я же русским языком написал: "Создаю пустой консольный проект"!
ForEveR
Модератор
Эксперт С++
7958 / 4720 / 319
Регистрация: 24.06.2010
Сообщений: 10,525
Завершенные тесты: 3
24.10.2012, 17:18     Не компилируются программы: Отсутствует обязательный файл "" #4
florgas,
1>LINK : error LNK2001: неразрешенный внешний символ "_mainCRTStartup"
Как бэ функция main должна быть.
Yandex
Объявления
24.10.2012, 17:18     Не компилируются программы: Отсутствует обязательный файл ""
Ответ Создать тему
Опции темы

Текущее время: 18:09. Часовой пояс GMT +3.
КиберФорум - форум программистов, компьютерный форум, программирование
Powered by vBulletin® Version 3.8.9
Copyright ©2000 - 2017, vBulletin Solutions, Inc.
Рейтинг@Mail.ru