Форум программистов, компьютерный форум CyberForum.ru

HTML5: мобильные приложения

Войти
Регистрация
Восстановить пароль
 
Рейтинг: Рейтинг темы: голосов - 13, средняя оценка - 4.77
Sam Lewis
0 / 0 / 0
Регистрация: 05.02.2013
Сообщений: 3
#1

Sencha cmd билд еррор: com.sencha.exceptions.ExScript: SyntaxError: missing ] after element list - HTML5

03.05.2013, 15:04. Просмотров 1629. Ответов 0
Метки нет (Все метки)

Использую Sencha cmd чтобы сбилдить testing app - sencha app build testing.

После [INF] building application - сразу [ERR] BUILD FAILED.

Запускаю на Win7. Весь код:

C:\sencha\sencha-touch-2.2.0-gpl\SenchaCordova>sencha app build testing
Sencha Cmd v3.1.1.274
[INF]
[INF] init-plugin:
[INF]
[INF] init-plugin:
[INF]
[INF] -before-app-build:
[INF]
[INF] cmd-root-plugin.init-properties:
[INF]
[INF] init-properties:
[INF]
[INF] init-sencha-command:
[INF]
[INF] init:
[INF]
[INF] -before-app-build:
[INF]
[INF] app-build-impl:
[INF]
[INF] testing:
[INF]
[INF] -before-init-local:
[INF]
[INF] -init-local:
[INF]
[INF] -after-init-local:
[INF]
[INF] init-local:
[INF]
[INF] find-cmd:
[INF]
[INF] -before-init:
[INF]
[INF] -init:
[INF] Initializing Sencha Cmd ant environment
[INF] Adding antlib taskdef for com/sencha/command/compass/ant/antlib.xml
[INF]
[INF] -after-init:
[INF]
[INF] init:
[INF]
[INF] -before-build:
[INF]
[INF] sass:
[INF]
[INF] -before-sass:
[INF]
[INF] -sass:
[INF] executing compass using system installed ruby runtime
identical ../css/app.css
[INF]
[INF] -after-sass:
[INF]
[INF] page:
[INF]
[INF] -before-page:
[INF]
[INF] -page:
[INF] building application
[ERR]
[ERR] BUILD FAILED
[ERR] com.sencha.exceptions.BasicException: The following error occurred while e
xecuting this line:
[ERR] C:\sencha\sencha-touch-2.2.0-gpl\SenchaCordova\.sencha\app\build-impl.xml:
249: com.sencha.exceptions.ExScript: SyntaxError: missing ] after element list (
C:\Users\Sam\bin\Sencha\Cmd\3.1.1.274\ant\ant-util.js#605(eval)#47) readCo
nfig (C:\Users\Sam\bin\Sencha\Cmd\3.1.1.274\ant\ant-util.js:605) runAppBui
ld (x-app-build:9) [anonymous] (x-app-build:571) x_app_build (x-app-build:56
9) <script> (anonymous:1)
[ERR]
[ERR]
[ERR] Total time: 7 seconds
[ERR] com.sencha.exceptions.BasicException: The following error occurred while e
xecuting this line:
C:\sencha\sencha-touch-2.2.0-gpl\SenchaCordova\.sencha\app\build-impl.xml:249: c
om.sencha.exceptions.ExScript: SyntaxError: missing ] after element list (C:\Use
rs\Sam\bin\Sencha\Cmd\3.1.1.274\ant\ant-util.js#605(eval)#47)
readConfig (C:\Users\Sam\bin\Sencha\Cmd\3.1.1.274\ant\ant-util.js:605)
runAppBuild (x-app-build:9)
[anonymous] (x-app-build:571)
x_app_build (x-app-build:569)
<script> (anonymous:1)

Подскажите, плиз, в чем проблема и как исправить.

Заранее огромное спасибо!
Similar
Эксперт
41792 / 34177 / 6122
Регистрация: 12.04.2006
Сообщений: 57,940
03.05.2013, 15:04     Sencha cmd билд еррор: com.sencha.exceptions.ExScript: SyntaxError: missing ] after element list
Посмотрите здесь:
HTML5 Create.bat error при создании апликации через CMD
sencha touch nested list ExtJS
JavaScript: SyntaxError: missing ) after argument list jQuery
Uncaught SyntaxError: missing ) after argument list jQuery
jQuery Ошибка: SyntaxError: missing ) after argument list
ExtJS Sencha touch 2 неправильное отображение на ios 5.1
[Sencha Touch 2] Как добавить CSS файл динамически? ExtJS
Ошибка: "Uncaught SyntaxError: missing ) after argument list" jQuery
SlideDown missing ) after argument list JavaScript
missing function header (old-style formal list?) C++
Visual C++ error C2447: missing function header (old-style formal list?)
error C2447: '{' : missing function header (old-style formal list?) C++

Искать еще темы с ответами

Или воспользуйтесь поиском по форуму:
После регистрации реклама в сообщениях будет скрыта и будут доступны все возможности форума.
Ответ Создать тему
Опции темы

КиберФорум - форум программистов, компьютерный форум, программирование
Powered by vBulletin® Version 3.8.9
Copyright ©2000 - 2017, vBulletin Solutions, Inc.
Рейтинг@Mail.ru