Форум программистов, компьютерный форум CyberForum.ru

структуры подскажите где ошибки - C++

Войти
Регистрация
Восстановить пароль
Другие темы раздела
C++ компилятор пропускает строчки с инициализацией http://www.cyberforum.ru/cpp-beginners/thread33255.html
здравствуйте! Копмилятор пропускает строчки с инициализацией переменных. При попытке поставить маркер, переносит этот маркер на строчку ниже. Переменные при этом инициализируются какими-то левыми значениями. В чем может быть проблема?
C++ Телефонная книга. нужна помощь в настроике настроить поиск. #include <string.h> #include <stdio.h> #include <windows.h> void funkcia1() { int i,j=1; for(i=0;i<90;i++) printf("%c",j); http://www.cyberforum.ru/cpp-beginners/thread33234.html
C++ работа с указателями
небольшая проблемка, никак не могу разобраться с указателями. Я так понял что создавая массив лучше если сразу сдалешь на него указатель и будешь работать с ним, нежели с самим массивом, тип так экономичнее для ресурсов компа, я ведь правильно понял? #include <cstdlib> #include <iostream> #include <stdio.h> short int const n = 3; using namespace std;
C++ поиск маршрута. Задача на С#.
Задача следующая: Некая географическая карта местности задана квадратной сеткой определенного масштаба. В узлах сетки известна высота над уровнем моря. Между соседними узлами высота меняется плавно. Имеется караван, перемещающийся только по линиям сетки, перемещение по диагоналям запрещается. Путь между двумя соседними точками с углом наклона больше 45 градусов считается непроходимым....
C++ Програма с .тхт файлом http://www.cyberforum.ru/cpp-beginners/thread33219.html
вот код #include <windows.h> #include <stdio.h> #include <conio.h> FILE *f; typedef struct tagINFO {
C++ Обработка русского текста в консольном режиме. Приветствую всех, Собственно вопрос: Создаю строковую переменную, посредством cin заношу в неё текст на русском, распечатываю cout'ом и получаю хлам. Типа ввоже йцукен, получаю ©жгЄҐ* В принципе, я могу перед выводом на экран у каждого символа "сдвинуть" кодировку, но может есть более простой способ? Заранее благодарен. подробнее

Показать сообщение отдельно
83snake
0 / 0 / 0
Регистрация: 06.04.2009
Сообщений: 30
08.05.2009, 14:18  [ТС]
Patch,
спасибо ты был прав я исправил но оно все равно ввыдает ошибки:

c:\documents and settings\змей\рабочий стол\hoome\kyrsak\kyrsak\kyrsak01.cpp(370) : error C2228: left of '.deportam' must have class/struct/union
type is 'const depor [30]'
c:\documents and settings\змей\рабочий стол\hoome\kyrsak\kyrsak\kyrsak01.cpp(371) : error C2228: left of '.dolz' must have class/struct/union
type is 'const depor [30]'
c:\documents and settings\змей\рабочий стол\hoome\kyrsak\kyrsak\kyrsak01.cpp(372) : error C2228: left of '.nomber' must have class/struct/union
type is 'const depor [30]'
c:\documents and settings\змей\рабочий стол\hoome\kyrsak\kyrsak\kyrsak01.cpp(391) : error C2228: left of '.deportam' must have class/struct/union
type is 'depor [30]'
c:\documents and settings\змей\рабочий стол\hoome\kyrsak\kyrsak\kyrsak01.cpp(393) : error C2228: left of '.dolz' must have class/struct/union
type is 'depor [30]'
c:\documents and settings\змей\рабочий стол\hoome\kyrsak\kyrsak\kyrsak01.cpp(395) : error C2228: left of '.nomber' must have class/struct/union
type is 'depor [30]'
c:\documents and settings\змей\рабочий стол\hoome\kyrsak\kyrsak\kyrsak01.cpp(417) : error C2228: left of '.deportam' must have class/struct/union
type is 'const depor [30]'
c:\documents and settings\змей\рабочий стол\hoome\kyrsak\kyrsak\kyrsak01.cpp(417) : error C2664: 'strcpy' : cannot convert parameter 1 from 'depor [30]' to 'char *'
Types pointed to are unrelated; conversion requires reinterpret_cast, C-style cast or function-style cast
c:\documents and settings\змей\рабочий стол\hoome\kyrsak\kyrsak\kyrsak01.cpp(418) : error C2228: left of '.dolz' must have class/struct/union
type is 'const depor [30]'
c:\documents and settings\змей\рабочий стол\hoome\kyrsak\kyrsak\kyrsak01.cpp(418) : error C2664: 'strcpy' : cannot convert parameter 1 from 'depor [30]' to 'char *'
Types pointed to are unrelated; conversion requires reinterpret_cast, C-style cast or function-style cast
c:\documents and settings\змей\рабочий стол\hoome\kyrsak\kyrsak\kyrsak01.cpp(419) : error C2228: left of '.nomber' must have class/struct/union
type is 'const depor [30]'
c:\documents and settings\змей\рабочий стол\hoome\kyrsak\kyrsak\kyrsak01.cpp(419) : error C2664: 'strcpy' : cannot convert parameter 1 from 'depor [30]' to 'char *'
Types pointed to are unrelated; conversion requires reinterpret_cast, C-style cast or function-style cast
c:\documents and settings\змей\рабочий стол\hoome\kyrsak\kyrsak\kyrsak01.cpp(430) : error C2228: left of '.deportam' must have class/struct/union
type is 'const depor [30]'
c:\documents and settings\змей\рабочий стол\hoome\kyrsak\kyrsak\kyrsak01.cpp(430) : error C2664: 'strcpy' : cannot convert parameter 1 from 'depor [30]' to 'char *'
Types pointed to are unrelated; conversion requires reinterpret_cast, C-style cast or function-style cast
c:\documents and settings\змей\рабочий стол\hoome\kyrsak\kyrsak\kyrsak01.cpp(431) : error C2228: left of '.dolz' must have class/struct/union
type is 'const depor [30]'
c:\documents and settings\змей\рабочий стол\hoome\kyrsak\kyrsak\kyrsak01.cpp(431) : error C2664: 'strcpy' : cannot convert parameter 1 from 'depor [30]' to 'char *'
Types pointed to are unrelated; conversion requires reinterpret_cast, C-style cast or function-style cast
c:\documents and settings\змей\рабочий стол\hoome\kyrsak\kyrsak\kyrsak01.cpp(432) : error C2228: left of '.nomber' must have class/struct/union
type is 'const depor [30]'
c:\documents and settings\змей\рабочий стол\hoome\kyrsak\kyrsak\kyrsak01.cpp(432) : error C2664: 'strcpy' : cannot convert parameter 1 from 'depor [30]' to 'char *'
Types pointed to are unrelated; conversion requires reinterpret_cast, C-style cast or function-style cast
c:\documents and settings\змей\рабочий стол\hoome\kyrsak\kyrsak\kyrsak01.cpp(450) : error C3861: 'copy_p': identifier not found
c:\documents and settings\змей\рабочий стол\hoome\kyrsak\kyrsak\kyrsak01.cpp(461) : error C2065: 'st' : undeclared identifier
c:\documents and settings\змей\рабочий стол\hoome\kyrsak\kyrsak\kyrsak01.cpp(461) : error C2228: left of '.name' must have class/struct/union
c:\documents and settings\змей\рабочий стол\hoome\kyrsak\kyrsak\kyrsak01.cpp(473) : error C2228: left of '.deportam' must have class/struct/union
type is 'const depor [30]'
c:\documents and settings\змей\рабочий стол\hoome\kyrsak\kyrsak\kyrsak01.cpp(473) : error C2664: 'strcpy' : cannot convert parameter 1 from 'depor [30]' to 'char *'
Types pointed to are unrelated; conversion requires reinterpret_cast, C-style cast or function-style cast
c:\documents and settings\змей\рабочий стол\hoome\kyrsak\kyrsak\kyrsak01.cpp(474) : error C2228: left of '.dolz' must have class/struct/union
type is 'const depor [30]'
c:\documents and settings\змей\рабочий стол\hoome\kyrsak\kyrsak\kyrsak01.cpp(474) : error C2664: 'strcpy' : cannot convert parameter 1 from 'depor [30]' to 'char *'
Types pointed to are unrelated; conversion requires reinterpret_cast, C-style cast or function-style cast
c:\documents and settings\змей\рабочий стол\hoome\kyrsak\kyrsak\kyrsak01.cpp(475) : error C2228: left of '.nomber' must have class/struct/union
type is 'const depor [30]'
c:\documents and settings\змей\рабочий стол\hoome\kyrsak\kyrsak\kyrsak01.cpp(475) : error C2664: 'strcpy' : cannot convert parameter 1 from 'depor [30]' to 'char *'
Types pointed to are unrelated; conversion requires reinterpret_cast, C-style cast or function-style cast
c:\documents and settings\змей\рабочий стол\hoome\kyrsak\kyrsak\kyrsak01.cpp(502) : error C2144: syntax error : 'int' should be preceded by ';'
c:\documents and settings\змей\рабочий стол\hoome\kyrsak\kyrsak\kyrsak01.cpp(505) : error C2065: 'color' : undeclared identifier
c:\documents and settings\змей\рабочий стол\hoome\kyrsak\kyrsak\kyrsak01.cpp(515) : error C2196: case value '1' already used
c:\documents and settings\змей\рабочий стол\hoome\kyrsak\kyrsak\kyrsak01.cpp(533) : error C2360: initialization of 'nEn' is skipped by 'case' label
c:\documents and settings\змей\рабочий стол\hoome\kyrsak\kyrsak\kyrsak01.cpp(525) : see declaration of 'nEn'
c:\documents and settings\змей\рабочий стол\hoome\kyrsak\kyrsak\kyrsak01.cpp(537) : error C2065: 'test' : undeclared identifier
c:\documents and settings\змей\рабочий стол\hoome\kyrsak\kyrsak\kyrsak01.cpp(541) : error C2065: 'test' : undeclared identifier
c:\documents and settings\змей\рабочий стол\hoome\kyrsak\kyrsak\kyrsak01.cpp(545) : error C2360: initialization of 'nEn' is skipped by 'case' label
c:\documents and settings\змей\рабочий стол\hoome\kyrsak\kyrsak\kyrsak01.cpp(525) : see declaration of 'nEn'
c:\documents and settings\змей\рабочий стол\hoome\kyrsak\kyrsak\kyrsak01.cpp(549) : error C2360: initialization of 'nEn' is skipped by 'case' label
c:\documents and settings\змей\рабочий стол\hoome\kyrsak\kyrsak\kyrsak01.cpp(525) : see declaration of 'nEn'
c:\documents and settings\змей\рабочий стол\hoome\kyrsak\kyrsak\kyrsak01.cpp(553) : error C2360: initialization of 'nEn' is skipped by 'case' label
c:\documents and settings\змей\рабочий стол\hoome\kyrsak\kyrsak\kyrsak01.cpp(525) : see declaration of 'nEn'
c:\documents and settings\змей\рабочий стол\hoome\kyrsak\kyrsak\kyrsak01.cpp(557) : error C2360: initialization of 'nEn' is skipped by 'case' label
c:\documents and settings\змей\рабочий стол\hoome\kyrsak\kyrsak\kyrsak01.cpp(525) : see declaration of 'nEn'
c:\documents and settings\змей\рабочий стол\hoome\kyrsak\kyrsak\kyrsak01.cpp(561) : error C2360: initialization of 'nEn' is skipped by 'case' label
c:\documents and settings\змей\рабочий стол\hoome\kyrsak\kyrsak\kyrsak01.cpp(525) : see declaration of 'nEn'
c:\documents and settings\змей\рабочий стол\hoome\kyrsak\kyrsak\kyrsak01.cpp(565) : error C2360: initialization of 'nEn' is skipped by 'case' label
c:\documents and settings\змей\рабочий стол\hoome\kyrsak\kyrsak\kyrsak01.cpp(525) : see declaration of 'nEn'
c:\documents and settings\змей\рабочий стол\hoome\kyrsak\kyrsak\kyrsak01.cpp(569) : error C2360: initialization of 'nEn' is skipped by 'case' label
c:\documents and settings\змей\рабочий стол\hoome\kyrsak\kyrsak\kyrsak01.cpp(525) : see declaration of 'nEn'
Build log was saved at "file://c:\Documents and Settings\ЗМЕЙ\Рабочий стол\hoome\kyrsak\kyrsak\Debug\BuildLog.htm"
kyrsak - 40 error(s), 0 warning(s)
========== Build: 0 succeeded, 1 failed, 0 up-to-date, 0 skipped ==========
 
КиберФорум - форум программистов, компьютерный форум, программирование
Powered by vBulletin® Version 3.8.9
Copyright ©2000 - 2017, vBulletin Solutions, Inc.
Рейтинг@Mail.ru