Форум программистов, компьютерный форум, киберфорум
Наши страницы

Симплетрон - C++

Войти
Регистрация
Восстановить пароль
Другие темы раздела
C++ Идентификатор не найден http://www.cyberforum.ru/cpp/thread42191.html
что не так....кажется все уже проверил... error C3861: sum_full: идентификатор не найден c:\documents and settings\admin\рабочий стол\compressed_matrix\compressed_matrix\main.cpp full_matrix...
C++ fseek вместо дополнительного массива (язык Си) Задача - в текстовом файл заменить все последовательности идущих подряд пробелов одним пробелом. Новый файл не создавать. Описание программы - прежде всего сохраняю размер текстового файла в... http://www.cyberforum.ru/cpp/thread42094.html
C++ Реализация идеомы UniqueType
Идея проста и стоит во главе идеологии C++: std::string password, login; unsigned short TCPport, YearOfBirth; Компилятор запрещает бессмысленные присвоения: login = TCPport; // error Однако не...
Литература по Win API C++
Посоветуйте пожалуйсто книгу где изложены основы программирования с win API доступным языком с использованием C++
C++ C:\Dev-Cpp\Makefile.win [Build Error] [Безымянный1.o] Error 1 http://www.cyberforum.ru/cpp/thread41323.html
C:\Dev-Cpp\Makefile.win Error 1 компилятор стал показывать такую ошибку, после того как я открыл эту папку редактором и удалил от туда текст. Но это не главное. удалил этот компилятор, закачал...
C++ pow: OVERFLOW error...Floating Point: Overflow Помогите разобраться почему в программе выводятся эти ошибки после ввода значений ----------------------- pow: OVERFLOW error Floating Point: Overflow ----------------------- #include... подробнее

Показать сообщение отдельно
RazorQ
581 / 348 / 9
Регистрация: 06.02.2009
Сообщений: 1,386

Симплетрон - C++

28.06.2009, 15:22. Просмотров 1413. Ответов 1
Метки (Все метки)

Прошу помощи с проектом. Во время компиляции вылетают следующие ошибки
Код
Compiling...
1>postfix.cpp
1>e:\g7\sim\sim\stack.h(5) : error C2011: 'stack' : 'class' type redefinition
1>        e:\g7\sim\sim\stack.h(5) : see declaration of 'stack'
1>e:\g7\sim\sim\postfix.cpp(7) : error C2079: 'st' uses undefined class 'stack'
1>e:\g7\sim\sim\postfix.cpp(71) : error C2228: left of '.put' must have class/struct/union
1>        type is 'int'
1>e:\g7\sim\sim\postfix.cpp(77) : error C2228: left of '.isEmpty' must have class/struct/union
1>        type is 'int'
1>e:\g7\sim\sim\postfix.cpp(77) : fatal error C1903: unable to recover from previous error(s); stopping compilation
1>Sim.cpp
1>e:\g7\sim\sim\stack.h(5) : error C2011: 'stack' : 'class' type redefinition
1>        e:\g7\sim\sim\stack.h(5) : see declaration of 'stack'
1>e:\g7\sim\sim\sim.cpp(43) : error C2512: 'postfix' : no appropriate default constructor available
1>Generating Code...
Проект в архиве. (VS)
0
Вложения
Тип файла: zip Sim.zip (766.5 Кб, 30 просмотров)
Надоела реклама? Зарегистрируйтесь и она исчезнет полностью.
 
КиберФорум - форум программистов, компьютерный форум, программирование
Powered by vBulletin® Version 3.8.9
Copyright ©2000 - 2017, vBulletin Solutions, Inc.
Рейтинг@Mail.ru