Форум программистов, компьютерный форум, киберфорум
Наши страницы

в чем ошибка ?(( - C++

Войти
Регистрация
Восстановить пароль
Другие темы раздела
C++ Массивы http://www.cyberforum.ru/cpp-beginners/thread55963.html
Помогите пожалуйста со следующими заданиями: 1. Даны числа n и m (вводятся с клавиатуры). Создайте массив int A и заполните его следующим образом (ниже приведен пример для n=4 и m=6): ...
C++ Сумма элементов трехмерного массива Имеется трехмерный массив из 3-ех слоев по 3Х3 элемента в каждом слое, в первом слое все элементы единицы, во втором слое - двойки, в третьем слое - тройки. Имеется цикл, заполняющий массив этими... http://www.cyberforum.ru/cpp-beginners/thread55947.html
Сортування вибором C++
Написати програму алгоритмічною мовою С++ згідно з завданням, отриманим від викладача за табл. 1: задану прямокутну матрицю A={aij} відсортувати за вказаним алгоритмом; для відсортованої матриці...
C++ Как преобразовать длинное имя в короткое
Добрый день! Помогите, пожалуйста, разобраться с функцией: DWORD GetShortPathName(LPCTSTR lpszLongPath, LPTSTR lpszShortPath, DWORD cchBuffer); получаю длинный путь, используя LongName =...
C++ Двухмерные массивы(матрица символов) http://www.cyberforum.ru/cpp-beginners/thread55939.html
Вывести для каждой строки и каждого столбца символ который колличественно преобладает. В том случае если таких символов нет то вывести первый символ строки или столбца и на экран вывести итоговую...
C++ Вычисление суммы 10 заданных целых чисел вот 2 вопроса первый простой для спецов а второй может я чтото не понял но в лабе он так и звучит. 1) Составить программу для вычисления суммы 10 заданных целых чисел. 2) Создать класс... подробнее

Показать сообщение отдельно
Pavel1133
3 / 3 / 0
Регистрация: 12.10.2009
Сообщений: 81
12.10.2009, 17:42  [ТС]
#include <iostream>
using namespace std;
int main();
int j=1, i , N, w;
cout << "vvedite 4islo" << endl;
cin >> i << endl;
w=i;
cout << "vvedite stepen'" << endl;
cin >> N << endl;
while (j<N) {
i=i*w;
j++;
}
cout << i << endl;
system("pause");


1>------ Build started: Project: aaa, Configuration: Debug Win32 ------
1>Compiling...
1>Source1.cpp
1>c:\documents and settings\администратор\мои документы\visual studio 2008\projects\aaa\aaa\source1.cpp(5) : error C2143: syntax error : missing ';' before '<<'
1>c:\documents and settings\администратор\мои документы\visual studio 2008\projects\aaa\aaa\source1.cpp(5) : error C4430: missing type specifier - int assumed. Note: C++ does not support default-int
1>c:\documents and settings\администратор\мои документы\visual studio 2008\projects\aaa\aaa\source1.cpp(6) : error C2143: syntax error : missing ';' before '>>'
1>c:\documents and settings\администратор\мои документы\visual studio 2008\projects\aaa\aaa\source1.cpp(6) : error C4430: missing type specifier - int assumed. Note: C++ does not support default-int
1>c:\documents and settings\администратор\мои документы\visual studio 2008\projects\aaa\aaa\source1.cpp(7) : error C4430: missing type specifier - int assumed. Note: C++ does not support default-int
1>c:\documents and settings\администратор\мои документы\visual studio 2008\projects\aaa\aaa\source1.cpp(7) : error C2086: 'int w' : redefinition
1> c:\documents and settings\администратор\мои документы\visual studio 2008\projects\aaa\aaa\source1.cpp(4) : see declaration of 'w'
1>c:\documents and settings\администратор\мои документы\visual studio 2008\projects\aaa\aaa\source1.cpp(8) : error C2143: syntax error : missing ';' before '<<'
1>c:\documents and settings\администратор\мои документы\visual studio 2008\projects\aaa\aaa\source1.cpp(8) : error C4430: missing type specifier - int assumed. Note: C++ does not support default-int
1>c:\documents and settings\администратор\мои документы\visual studio 2008\projects\aaa\aaa\source1.cpp(8) : error C2086: 'int cout' : redefinition
1> c:\documents and settings\администратор\мои документы\visual studio 2008\projects\aaa\aaa\source1.cpp(5) : see declaration of 'cout'
1>c:\documents and settings\администратор\мои документы\visual studio 2008\projects\aaa\aaa\source1.cpp(9) : error C2143: syntax error : missing ';' before '>>'
1>c:\documents and settings\администратор\мои документы\visual studio 2008\projects\aaa\aaa\source1.cpp(9) : error C4430: missing type specifier - int assumed. Note: C++ does not support default-int
1>c:\documents and settings\администратор\мои документы\visual studio 2008\projects\aaa\aaa\source1.cpp(9) : error C2086: 'int cin' : redefinition
1> c:\documents and settings\администратор\мои документы\visual studio 2008\projects\aaa\aaa\source1.cpp(6) : see declaration of 'cin'
1>c:\documents and settings\администратор\мои документы\visual studio 2008\projects\aaa\aaa\source1.cpp(10) : error C2059: syntax error : 'while'
1>c:\documents and settings\администратор\мои документы\visual studio 2008\projects\aaa\aaa\source1.cpp(10) : error C2143: syntax error : missing ';' before '{'
1>c:\documents and settings\администратор\мои документы\visual studio 2008\projects\aaa\aaa\source1.cpp(10) : error C2447: '{' : missing function header (old-style formal list?)
1>c:\documents and settings\администратор\мои документы\visual studio 2008\projects\aaa\aaa\source1.cpp(14) : error C2143: syntax error : missing ';' before '<<'
1>c:\documents and settings\администратор\мои документы\visual studio 2008\projects\aaa\aaa\source1.cpp(14) : error C4430: missing type specifier - int assumed. Note: C++ does not support default-int
1>c:\documents and settings\администратор\мои документы\visual studio 2008\projects\aaa\aaa\source1.cpp(14) : error C2086: 'int cout' : redefinition
1> c:\documents and settings\администратор\мои документы\visual studio 2008\projects\aaa\aaa\source1.cpp(5) : see declaration of 'cout'
1>c:\documents and settings\администратор\мои документы\visual studio 2008\projects\aaa\aaa\source1.cpp(15) : error C4430: missing type specifier - int assumed. Note: C++ does not support default-int
1>c:\documents and settings\администратор\мои документы\visual studio 2008\projects\aaa\aaa\source1.cpp(15) : error C2365: 'system' : redefinition; previous definition was 'function'
1> d:\mvs c++\vc\include\stdlib.h(521) : see declaration of 'system'
1>c:\documents and settings\администратор\мои документы\visual studio 2008\projects\aaa\aaa\source1.cpp(15) : error C2440: 'initializing' : cannot convert from 'const char [6]' to 'int'
1> There is no context in which this conversion is possible
1>Build log was saved at "file://c:\Documents and Settings\Администратор\Мои документы\Visual Studio 2008\Projects\aaa\aaa\Debug\BuildLog.htm"
1>aaa - 21 error(s), 0 warning(s)
========== Build: 0 succeeded, 1 failed, 0 up-to-date, 0 skipped ==========

Добавлено через 32 секунды
sps na 3 oshibki menshe )

Добавлено через 4 минуты
missing ';' before '<<'
kakoito bred
0
 
КиберФорум - форум программистов, компьютерный форум, программирование
Powered by vBulletin® Version 3.8.9
Copyright ©2000 - 2017, vBulletin Solutions, Inc.
Рейтинг@Mail.ru