Форум программистов, компьютерный форум CyberForum.ru
Наши страницы

error: ISO C++ forbids declaration of 'Time' with no type - C++

Войти
Регистрация
Восстановить пароль
Другие темы раздела
C++ Массив и файлы http://www.cyberforum.ru/cpp-beginners/thread827248.html
Здравствуйте.Помогите решить проблемку. Восстанавливаю массив из файла,минимально значение такое как нужно, а среднее арифметическое отличается от предыдущего, в чем проблема не пойму. #include...
C++ Автоматические конвертеры стилей наименования объектов Существуют ли средства позволяющие в автоматическом режиме сконвертировать наименования переменных/функций во всем проекте из одного стиля в другой? Например, привести все к qt-стилю - приватные поля... http://www.cyberforum.ru/cpp-beginners/thread827238.html
Реализация основного класса C++
Помогите пожалуйста!!! Вспомогательный класс вроде написал, а основной не получается!!!! Требуется реализовать 2 класса. Один класс является основным, другой – вспомогательным. Несколько...
Количество слов в строке C++
как сделать так чтобы количество символов в строке по которым цикл должен пробежать определялось во время ввода. но при вводе получается мы изменяем размер массива но этого же делать нельзя?это...
C++ АДТ - динамический одномерный массив (вектор) действительных чисел http://www.cyberforum.ru/cpp-beginners/thread827211.html
1. Выбрать класс АТД согласно варианту. 2. Определить и реализовать в классе конструкторы, деструктор, функции Input (ввод с клавиатуры) и Print (вывод на экран). 3. Написать программу тестирования...
C++ Массив (вычислить сумму и напечатать номера элементов не равны нулю, больше b и меньше а) дано массив Х=(12.37, 16.55, 2.43, 0.81, 0.32, 1.345,-12.18, 0.15, -4.314, 1.29, 54.38, 0.214, -3.837,0.918, -75.014) и a=3.14, b=-7.8 вычислить сумму и напечатать номера элементов не равны нулю,... подробнее

Показать сообщение отдельно
Stasito
0 / 0 / 0
Регистрация: 08.12.2011
Сообщений: 25

error: ISO C++ forbids declaration of 'Time' with no type - C++

03.04.2013, 20:21. Просмотров 896. Ответов 4
Метки (Все метки)

C++
1
2
3
4
5
6
7
8
9
10
11
12
13
14
15
16
17
18
19
20
21
22
23
24
25
26
27
28
29
30
31
32
33
34
35
36
37
38
39
40
41
42
43
44
#ifndef _TIMELL_H
 
#define _TIMELL_H
 
#include <iostream>
#include <string>
#include "Time.h"
 
using namespace std;
//class Time;
    class TimeLL
    {
    private:
        class TimeNode//Nodes with data related to class Time
        {
//          class Time;
        public:
            Time *time;
                TimeNode *next;
        TimeNode *back;
 
        TimeNode();
                 TimeNode(Time *new_time);
                 ~TimeNode();
    };
    TimeNode* head_list;
    TimeNode *tail_list;
    void AddToHead(Time* new_time);
 
    public:
    TimeLL();
    int count;
    //void AddToHead(Time* new_time);
    void AddNew(Time *s1,Time *s2);
    void Del(Time *del_t);
    void DelAll();
    Time* SearchKey(int code,string timeToDel);
    Time* SearchIndex(int place);
    ~TimeLL();
    };
    
 
 
#endif



C++
1
2
3
4
5
6
7
8
9
10
11
12
13
14
15
16
17
18
19
20
21
22
23
24
25
26
27
28
29
#ifndef _TIME_H
 
#define _TIME_H
 
#include <iostream>
#include <string>
#include "Movie.h"
//#include "TimeLL.h"
using namespace std;
 
class Time
{
private:
    string hour;
    Movie* movie;
 
    public:
    Time();
    Time(string t,Movie* m);
    
    int GetMovie(){return movie->GetCode();}
    void SetTime(string c){hour = c;}
    string GetName(){return movie->GetName();}
    string GetTime(){return hour;}
    
    ~Time();
 
};
#endif



g++ -c main.cpp -ansi -pedantic
TimeLL.h:24: error: ISO C++ forbids declaration of 'Time' with no type
TimeLL.h:24: error: expected ';' before '*' token
TimeLL.h:29: error: expected `)' before '*' token
TimeLL.h:34: error: 'Time' has not been declared
TimeLL.h:40: error: 'Time' has not been declared
TimeLL.h:40: error: 'Time' has not been declared
TimeLL.h:41: error: 'Time' has not been declared
TimeLL.h:43: error: ISO C++ forbids declaration of 'Time' with no type
TimeLL.h:43: error: expected ';' before '*' token
TimeLL.h:44: error: ISO C++ forbids declaration of 'Time' with no type
TimeLL.h:44: error: expected ';' before '*' token
Theater.h:32: error: 'Time' has not been declared
Theater.h:33: error: 'Time' has not been declared
make: *** [main.o] Error 1
0
Надоела реклама? Зарегистрируйтесь и она исчезнет полностью.
 
КиберФорум - форум программистов, компьютерный форум, программирование
Powered by vBulletin® Version 3.8.9
Copyright ©2000 - 2017, vBulletin Solutions, Inc.
Рейтинг@Mail.ru