Форум программистов, компьютерный форум CyberForum.ru

Sencha cmd билд еррор: com.sencha.exceptions.ExScript: SyntaxError: missing ] after element list - HTML5

Восстановить пароль Регистрация
Другие темы раздела
HTML5 Отправка смс http://www.cyberforum.ru/html5-mobile-apps/thread847056.html
Приветствую всех! Подскажите, как использую PhoneGap для WP7 можно отправить смс? Пробовал такой вариант: <a href="sms:8005551212">Send SMS</a> но он не работает( Буду рад любой помощи?
HTML5 ICloud sync problem В приложении использую Web SQL Database нужно сделать синхронизацию с iCloud Подскажите как это реализовать Я перепробовал несколько плагинов и все они не работают с phonegap 2.5.0 http://www.cyberforum.ru/html5-mobile-apps/thread842524.html
Закрепить портретную ориентацию экрана HTML5
Привет! Может знает кто, как запретить поворот экрана в приложении? чтоб была только портретная ориентация) прописывал в активити ориентацию портрет - не помогает, все равно приложение меняет ориентацию при повороте
HTML5 Find contact
Hello all. Here is part of my code. Can someone explain me why at first I see alert2, not alert1. And how to solve this problem! Thank in advance) var options = new ContactFindOptions(); options.filter=nick_name; var fields = ; navigator.contacts.find(fields, onSuccessFind, onErrorFind, options); alert("after search"); ...
HTML5 Phonegap Facebook Plugin: авторизация http://www.cyberforum.ru/html5-mobile-apps/thread818332.html
Народ. Столкнулся тут с проблемой. Прикручиваю к приложения авторизацию в Facebook через Phonegap Facebook Plugin (cordova). FB.init( { appId: "11111111", nativeInterface: CDV.FB, useCachedDialogs: false, status: true } ); FB.getLoginStatus не срабатывает: FB.getLoginStatus( function( response ) { alert( response.status ) }, false ); FB.getLoginStatus (force = true) в алерте выводит...
HTML5 WebView всем привет.. сейчас встал вопрос - как правильно подключать webView дело в том, что уже готово маленькое приложение на phoneGap. но вот некоторые функции нужны с сайта. для этого лучше было бы что бы вместо некоторых страниц приложения, открывался мобильный сайт в webView . как это сделать подскажите плиз подробнее

Показать сообщение отдельно
Sam Lewis
0 / 0 / 0
Регистрация: 05.02.2013
Сообщений: 3
03.05.2013, 15:04     Sencha cmd билд еррор: com.sencha.exceptions.ExScript: SyntaxError: missing ] after element list
Использую Sencha cmd чтобы сбилдить testing app - sencha app build testing.

После [INF] building application - сразу [ERR] BUILD FAILED.

Запускаю на Win7. Весь код:

C:\sencha\sencha-touch-2.2.0-gpl\SenchaCordova>sencha app build testing
Sencha Cmd v3.1.1.274
[INF]
[INF] init-plugin:
[INF]
[INF] init-plugin:
[INF]
[INF] -before-app-build:
[INF]
[INF] cmd-root-plugin.init-properties:
[INF]
[INF] init-properties:
[INF]
[INF] init-sencha-command:
[INF]
[INF] init:
[INF]
[INF] -before-app-build:
[INF]
[INF] app-build-impl:
[INF]
[INF] testing:
[INF]
[INF] -before-init-local:
[INF]
[INF] -init-local:
[INF]
[INF] -after-init-local:
[INF]
[INF] init-local:
[INF]
[INF] find-cmd:
[INF]
[INF] -before-init:
[INF]
[INF] -init:
[INF] Initializing Sencha Cmd ant environment
[INF] Adding antlib taskdef for com/sencha/command/compass/ant/antlib.xml
[INF]
[INF] -after-init:
[INF]
[INF] init:
[INF]
[INF] -before-build:
[INF]
[INF] sass:
[INF]
[INF] -before-sass:
[INF]
[INF] -sass:
[INF] executing compass using system installed ruby runtime
identical ../css/app.css
[INF]
[INF] -after-sass:
[INF]
[INF] page:
[INF]
[INF] -before-page:
[INF]
[INF] -page:
[INF] building application
[ERR]
[ERR] BUILD FAILED
[ERR] com.sencha.exceptions.BasicException: The following error occurred while e
xecuting this line:
[ERR] C:\sencha\sencha-touch-2.2.0-gpl\SenchaCordova\.sencha\app\build-impl.xml:
249: com.sencha.exceptions.ExScript: SyntaxError: missing ] after element list (
C:\Users\Sam\bin\Sencha\Cmd\3.1.1.274\ant\ant-util.js#605(eval)#47) readCo
nfig (C:\Users\Sam\bin\Sencha\Cmd\3.1.1.274\ant\ant-util.js:605) runAppBui
ld (x-app-build:9) [anonymous] (x-app-build:571) x_app_build (x-app-build:56
9) <script> (anonymous:1)
[ERR]
[ERR]
[ERR] Total time: 7 seconds
[ERR] com.sencha.exceptions.BasicException: The following error occurred while e
xecuting this line:
C:\sencha\sencha-touch-2.2.0-gpl\SenchaCordova\.sencha\app\build-impl.xml:249: c
om.sencha.exceptions.ExScript: SyntaxError: missing ] after element list (C:\Use
rs\Sam\bin\Sencha\Cmd\3.1.1.274\ant\ant-util.js#605(eval)#47)
readConfig (C:\Users\Sam\bin\Sencha\Cmd\3.1.1.274\ant\ant-util.js:605)
runAppBuild (x-app-build:9)
[anonymous] (x-app-build:571)
x_app_build (x-app-build:569)
<script> (anonymous:1)

Подскажите, плиз, в чем проблема и как исправить.

Заранее огромное спасибо!
После регистрации реклама в сообщениях будет скрыта и будут доступны все возможности форума.
 
Текущее время: 14:38. Часовой пояс GMT +3.
КиберФорум - форум программистов, компьютерный форум, программирование
Powered by vBulletin® Version 3.8.9
Copyright ©2000 - 2017, vBulletin Solutions, Inc.
Рейтинг@Mail.ru