Форум программистов, компьютерный форум CyberForum.ru

Как сделать чтоб отделяло IP и Port - C++

Войти
Регистрация
Восстановить пароль
Другие темы раздела
C++ Дано трехзначное число. Определить: какая из его цифр больше первая или вторая http://www.cyberforum.ru/cpp-beginners/thread940669.html
Дано трехзначное число. Определить: какая из его цифр больше первая или вторая;
C++ Атомарна ли операция битового сдвига? Система: Win7 x64. Один проц Intel i7 3770k. Предположим, что я в студии собираю 64-х битным компилятором проект, в котором есть: int x = 10; x = x >> 1; Ну это чисто для примера, а так по хорошему, "х" - глобальная переменная, которую пытаются по битово изменить много потоков... Интересно, является ли такая операция в 64x винде атомарна? http://www.cyberforum.ru/cpp-beginners/thread940665.html
Вычислить за минимальное число операций C++
Дано действительное число х. Не пользуясь никакими другими арифметическими операциями, кроме умножения, сложения и вычитания, вычислить за минимальное число операций 2х4 - Зх3 + 4х2 - 5х + 6
Вычислить сумму C++
Вычислить сумму: -12 + 22 - 32 + 42 + ... + 102. Условный оператор не использовать.
C++ Необходимо вывести на экран таблицу значений функции Y(x) и ее разложения в ряд S(x) http://www.cyberforum.ru/cpp-beginners/thread940603.html
Необходимо вывести на экран таблицу значений функции Y(x) и ее разложения в ряд S(x) для х, изменяющегося от а до b с шагом h=(b-a)/n. Близость значений S(x) и Y(x) во всем диапазоне значений х указывает на правильность вычисления S(x) и Y(x).
C++ Дано натуральное число n. Найти сумму n2 + (n+1)2+ . +(2n)2 Дано натуральное число n. Найти сумму n2 + (n+1)2+ ... +(2n)2 подробнее

Показать сообщение отдельно
Nice-crazy
5 / 5 / 2
Регистрация: 10.03.2013
Сообщений: 130
20.08.2013, 15:11  [ТС]     Как сделать чтоб отделяло IP и Port
Землянин спасибо тебе за этой чудесный код,Добра тебе,спасибо)

Добавлено через 22 минуты
Вставил код вылезла ошибка

C++
1
2
3
4
5
6
7
8
9
10
11
12
13
14
15
16
17
18
19
20
21
22
23
24
25
26
27
28
29
30
31
32
33
34
35
36
37
38
39
40
41
42
43
Build
  Checking project dependencies...
  Compiling Project1.cbproj (Debug, Win32)
  bcc32 command line for "Unit1.cpp"
    h:\rad\embarcadero\rad studio\10.0\bin\bcc32.exe -D_DEBUG -D_RTLDLL;USEPACKAGES -n.\Win32\Debug -I"h:\rad\embarcadero\rad 
    studio\10.0\include\windows\vcl";"H:\rad\Embarcadero\RAD Studio\10.0\include\boost_1_39\boost\tr1\tr1";"H:\rad\Embarcadero\RAD 
    Studio\10.0\include\boost_1_39";"h:\rad\embarcadero\rad studio\10.0\include";"h:\rad\embarcadero\rad studio\10.0\include\dinkumware";
    "h:\rad\embarcadero\rad studio\10.0\include\windows\crtl";"h:\rad\embarcadero\rad studio\10.0\include\windows\sdk";"h:\rad\embarcadero\rad 
    studio\10.0\include\windows\rtl";"h:\rad\embarcadero\rad studio\10.0\include\windows\vcl";"H:\Program Files\FastReports\LibD17";"C:\Program 
    Files\Raize\CS5\Lib\RS-XE3\Win32";"h:\rad\embarcadero\rad studio\10.0\include\windows\vcl";"H:\rad\Embarcadero\RAD 
    Studio\10.0\include\boost_1_39\boost\tr1\tr1";"H:\rad\Embarcadero\RAD Studio\10.0\include\boost_1_39";"h:\rad\embarcadero\rad studio\10.0\include";
    "h:\rad\embarcadero\rad studio\10.0\include\dinkumware";"h:\rad\embarcadero\rad studio\10.0\include\windows\crtl";"h:\rad\embarcadero\rad 
    studio\10.0\include\windows\sdk";"h:\rad\embarcadero\rad studio\10.0\include\windows\rtl";"h:\rad\embarcadero\rad studio\10.0\include\windows\vcl";
    "H:\Program Files\FastReports\LibD17";"C:\Program Files\Raize\CS5\Lib\RS-XE3\Win32" -y -Q -k -r- -c -tM -tU -tW -C8 -o.\Win32\Debug\Unit1.obj -w-par 
    -Od -v -vi- -H=.\Win32\Debug\Project1.pch -H Unit1.cpp 
  [bcc32 Error] Unit1.cpp(238): E2141 Declaration syntax error
  Failed
  Elapsed time: 00:00:01.2
Output
  Build started 20.08.2013 15:02:24.
  __________________________________________________
  Project "H:\Programmer_Projects\Projects_C++\narkutchik\Project1.cbproj" (Make target(s)):
  Target MakeObjs:
      Target _PasDepCheck:
          Skipping: H:\Programmer_Projects\Projects_C++\narkutchik\Project1.cbproj
      Target _CppDepCheck:
          Skipping: Project1.cpp
          Modified: Unit1.cpp
      Target CppCompile:
          Target _CppCoreCompile:
              Target _BCC32CoreCompile:
                  h:\rad\embarcadero\rad studio\10.0\bin\bcc32.exe -D_DEBUG -D_RTLDLL;USEPACKAGES -n.\Win32\Debug -I"h:\rad\embarcadero\rad studio\10.0\include\windows\vcl";"H:\rad\Embarcadero\RAD Studio\10.0\include\boost_1_39\boost\tr1\tr1";"H:\rad\Embarcadero\RAD Studio\10.0\include\boost_1_39";"h:\rad\embarcadero\rad studio\10.0\include";"h:\rad\embarcadero\rad studio\10.0\include\dinkumware";"h:\rad\embarcadero\rad studio\10.0\include\windows\crtl";"h:\rad\embarcadero\rad studio\10.0\include\windows\sdk";"h:\rad\embarcadero\rad studio\10.0\include\windows\rtl";"h:\rad\embarcadero\rad studio\10.0\include\windows\vcl";"H:\Program Files\FastReports\LibD17";"C:\Program Files\Raize\CS5\Lib\RS-XE3\Win32";"h:\rad\embarcadero\rad studio\10.0\include\windows\vcl";"H:\rad\Embarcadero\RAD Studio\10.0\include\boost_1_39\boost\tr1\tr1";"H:\rad\Embarcadero\RAD Studio\10.0\include\boost_1_39";"h:\rad\embarcadero\rad studio\10.0\include";"h:\rad\embarcadero\rad studio\10.0\include\dinkumware";"h:\rad\embarcadero\rad studio\10.0\include\windows\crtl";"h:\rad\embarcadero\rad studio\10.0\include\windows\sdk";"h:\rad\embarcadero\rad studio\10.0\include\windows\rtl";"h:\rad\embarcadero\rad studio\10.0\include\windows\vcl";"H:\Program Files\FastReports\LibD17";"C:\Program Files\Raize\CS5\Lib\RS-XE3\Win32" -y -Q -k -r- -c -tM -tU -tW -C8 -o.\Win32\Debug\Unit1.obj -w-par -Od -v -vi- -H=.\Win32\Debug\Project1.pch -H Unit1.cpp 
                  Unit1.cpp(238,12): error E2141: E2141 Declaration syntax error
              Done building target "_BCC32CoreCompile" in project "Project1.cbproj" -- FAILED.
          Done building target "_CppCoreCompile" in project "Project1.cbproj" -- FAILED.
      Done building target "CppCompile" in project "Project1.cbproj" -- FAILED.
  Done building target "MakeObjs" in project "Project1.cbproj" -- FAILED.
  Done building project "Project1.cbproj" -- FAILED.
  Build FAILED.
  Unit1.cpp(238,12): error E2141: E2141 Declaration syntax error
      0 Warning(s)
      1 Error(s)
  Time Elapsed 00:00:01.09
 
Текущее время: 11:07. Часовой пояс GMT +3.
КиберФорум - форум программистов, компьютерный форум, программирование
Powered by vBulletin® Version 3.8.9
Copyright ©2000 - 2017, vBulletin Solutions, Inc.
Рейтинг@Mail.ru