Форум программистов, компьютерный форум CyberForum.ru
Наши страницы

Укажите на ошибку - C++

Войти
Регистрация
Восстановить пароль
Другие темы раздела
C++ Объясните что именно делает "x%d, y%d: " или что это в даном коде http://www.cyberforum.ru/cpp-beginners/thread1038049.html
#include <iostream> #include <cmath> using namespace std; double rast(double x1, double y1, double x2, double y2) // Функція яка получає координати двох точок для обчислення відстані між ними...
C++ Описать класс "комната" Описать класс "комната", содержащий сведения о метраже, высоте потолков и количество окон. Предусмотреть инициализацию с проверкой допустимости значений полей. Описать методы вычисления площади и... http://www.cyberforum.ru/cpp-beginners/thread1038048.html
Составить программу сортировки массива строк с использованием указателей C++
Составить программу сортировки массива строк с использованием указателей.
Структура данных C++
Мне надо сделать односторонний связанный список. Но дело не в этом. Вот код, меня интересует может я не правильно как делаю? почему у меня первый елемент это конечный елемент хотя это вроде можно...
C++ Найти нормаль http://www.cyberforum.ru/cpp-beginners/thread1038008.html
Люди помогите пожалуйста. Преподаватель дал задание. найти нормали N1, N2 и Na. Не знаю как сделать(. Подскажите пожалуйста хоть как делать и с чего начать? Фото задания прилагается....
C++ В функции f3 необходимо присвоить строку одного массива другому Не получается присвоить значение одного массива другому в функции f3. Вроде бы нужно присваивать значение через указатель, но у меня не получается. Нужна помощь. #include "stdafx.h" #include... подробнее

Показать сообщение отдельно
Kristina-93
0 / 0 / 0
Регистрация: 09.12.2013
Сообщений: 28
11.12.2013, 23:55  [ТС]
monolit, сообщения компилятора
prog.cs(2,0): error CS1024: Wrong preprocessor directive
prog.cs(3,6): error CS1041: Identifier expected, `namespace' is a keyword
prog.cs(3,19): error CS1001: Unexpected symbol `;', expecting identifier
prog.cs(7,4): error CS1041: Identifier expected, `int' is a keyword
prog.cs(29,1): error CS8025: Parsing error
Compilation failed: 5 error(s), 0 warnings
0
 
КиберФорум - форум программистов, компьютерный форум, программирование
Powered by vBulletin® Version 3.8.9
Copyright ©2000 - 2017, vBulletin Solutions, Inc.
Рейтинг@Mail.ru