Форум программистов, компьютерный форум CyberForum.ru

Компилятор не хочит выполнять свою работу правильно - C++

Восстановить пароль Регистрация
Другие темы раздела
C++ Работа с классами http://www.cyberforum.ru/cpp-beginners/thread1076236.html
Имеется заголовочный файл В нем создаю два класса Vector и MyCamera. class Vector { public: float x,y,z; }; //---------------------------------------------------------------- class MyCamera {
C++ Как создать шаблон класса одномерного динамического массива? Нужно решить задачу(консольное приложение(совместимое с visual studio 2005)): Со-здать ша-блон кл-асса од-номерного ди-намического ма-ссива. Реализовать метод вывода массива на экран, метод реверсивного вывода массива. http://www.cyberforum.ru/cpp-beginners/thread1076235.html
Описать функцию Exp1(x,eps) вещественного типа, находящую приближенное значение функции exp(x) C++
помогите,пожалуйста, с задачей. знаю, что вопрос неоднократно поднимался, просматривал похожие темы, но многие дают приближенное значение с огромной погрешностью. Описать функцию Exp1(x,eps) вещественного типа (параметры x, eps — вещественные, eps > 0), находящую приближенное значение функции exp(x): exp(x) = 1 + x + x^2 / 2! + x^3 / 3! + ... + x^n / n! В сумме учитывать все слагаемые, большие...
C++ Даны две прямые в пространстве.Определить их взаимное расположение
Даны две прямые в пространстве.Определить их взаимное расположение. Решить предложенную задачу (использовать операторов: if, switch) Имеем: y = m1*x + b1 и y2 = m2*x + b2 Если m1 == m2 && b1 == b2 тогда равны Если m1 == m2 && b1 != b2 тогда параллельны Если m1 != m2 тогда пересекаются Напишите пожалуйста программу!!! (очень надо)
C++ Указатели на функцию http://www.cyberforum.ru/cpp-beginners/thread1076228.html
1. arcsin(x^3) bool arcs(double *x) { if (*x**x**x<=1 && *x**x**x>=-1) {*x=asin(*x**x**x); return true;} } правильно я написал или нет? 2.lnlg(x) - ? помогите написать функцию.
C++ Найти в предложении количество слов, после которых стоит несколько пробелов и удалить их Ребята помогите я на экзамене) Все очень печально) подробнее

Показать сообщение отдельно
HelpMeDelphi
0 / 0 / 0
Регистрация: 10.01.2014
Сообщений: 12
20.01.2014, 11:57     Компилятор не хочит выполнять свою работу правильно
Вот код:
C++
1
2
3
4
5
6
7
8
9
10
11
12
13
14
15
16
17
18
19
20
21
22
23
24
25
26
// test1.cpp : Defines the entry point for the console application.
//
#include <stdafx.h>
#include <iostream>
#include <string>
std::string name;
using namespace std;
 
int _tmain(int argc, _TCHAR* argv[])
{
    int size; // размер массива
    cout << "The array size: ";
    cin >> size; // получение размера массива
 
    int *massive = new int[size]; // Выделение памяти для массива
    
    for (int i = 0; i <= size; i++) { //  Цикл заполнения массива 
        massive[i] = i;
    }
    
    for (int i = size; i != 0 ; i--) { //  Цикл вывод значений его элементов(в обратном порядке)
       cout << "Value of " << i << " element is " << massive[i] << endl;
    }
    system("pause");  // задержка консоли
    return 0;
}
Visual Studio 2005

Ошибка:

Код
- Build started: Project: 12, Configuration: Debug Win32 —----
1>Compiling...
1>12.cpp
1>d:\12\12\12\12.cpp(11) : error C2146: syntax error : missing ';' before identifier '«'
1>d:\12\12\12\12.cpp(11) : error C2065: '«' : undeclared identifier
1>d:\12\12\12\12.cpp(11) : error C2143: syntax error : missing ';' before 'string'
1>d:\12\12\12\12.cpp(12) : error C2146: syntax error : missing ';' before identifier '»'
1>d:\12\12\12\12.cpp(12) : error C2065: '»' : undeclared identifier
1>d:\12\12\12\12.cpp(12) : error C2146: syntax error : missing ';' before identifier 'size'
1>d:\12\12\12\12.cpp(17) : error C2065: 'i' : undeclared identifier
1>d:\12\12\12\12.cpp(21) : error C2146: syntax error : missing ';' before identifier '«'
1>d:\12\12\12\12.cpp(21) : error C2143: syntax error : missing ';' before 'string'
1>d:\12\12\12\12.cpp(21) : error C2146: syntax error : missing ';' before identifier '«'
1>d:\12\12\12\12.cpp(21) : error C2146: syntax error : missing ';' before identifier 'i'
1>d:\12\12\12\12.cpp(21) : error C2146: syntax error : missing ';' before identifier '«'
1>d:\12\12\12\12.cpp(21) : error C2143: syntax error : missing ';' before 'string'
1>d:\12\12\12\12.cpp(21) : error C2146: syntax error : missing ';' before identifier '«'
1>d:\12\12\12\12.cpp(21) : error C2146: syntax error : missing ';' before identifier 'massive'
1>d:\12\12\12\12.cpp(21) : error C2146: syntax error : missing ';' before identifier '«'
1>d:\12\12\12\12.cpp(21) : error C2146: syntax error : missing ';' before identifier 'endl'
1>d:\12\12\12\12.cpp(21) : warning C4551: function call missing argument list
1>Build log was saved at "file://d:\12\12\12\Debug\BuildLog.htm"
1>12 - 17 error(s), 1 warning(s)
========== Build: 0 succeeded, 1 failed, 0 up-to-date, 0 skipped ==========
После регистрации реклама в сообщениях будет скрыта и будут доступны все возможности форума.
 
Текущее время: 16:40. Часовой пояс GMT +3.
КиберФорум - форум программистов, компьютерный форум, программирование
Powered by vBulletin® Version 3.8.9
Copyright ©2000 - 2016, vBulletin Solutions, Inc.
Рейтинг@Mail.ru