Форум программистов, компьютерный форум CyberForum.ru
Наши страницы

Eclipse ndk странные ошибки - Программирование Android

Войти
Регистрация
Восстановить пароль
Другие темы раздела
Программирование Android Сделать чтобы при нажатие на кнопку в textview дата листалась назад http://www.cyberforum.ru/android-dev/thread1140065.html
Здравствуйте, есть вопрос. как сделать чтобы при нажатие на кнопку в textview дата листалась назад. и чтобы месяц писался по Русски?
Программирование Android ManagedQuery deprecated String columns = { Media.DATA, Media._ID, Media.TITLE, Media.DISPLAY_NAME }; Cursor cursor = parentA.managedQuery(Media.EXTERNAL_CONTENT_URI, columns, null, null, null); int fileColumn =... http://www.cyberforum.ru/android-dev/thread1140016.html
Программирование Android Новый проект, обозначения
Обновил Android SDK и плагины для Eclipse. Как выглядит вновь созданный проект: MainActivity.java package com.example.cyberforum; import android.support.v7.app.ActionBarActivity; import...
SQLite синхронизация с MySQL Программирование Android
Здравствуйте! Подскажите пожалуйста если кто то сталкивался как синхронизировать базу данных SQLite на андроиде и MySQL на сервере. Добавлено через 4 часа 20 минут Точней чтобы все данные из...
Программирование Android Константы XML http://www.cyberforum.ru/android-dev/thread1139551.html
не подскажите где найти полный список всевозможных констант XML таких как "wrap_content","fill_parent" где описано что все эти константы значат?просто смотрел а полный список не нашел в инете не...
Программирование Android Некорректное отображение приложения в Graphic Layout и на телефоне Должно быть : Добавлено через 9 минут На эмуляторе все корректно отбражается на телефоне показывается только кусок приложения Вот Xml: <RelativeLayout... подробнее

Показать сообщение отдельно
contedevel
57 / 55 / 8
Регистрация: 07.10.2012
Сообщений: 598

Eclipse ndk странные ошибки - Программирование Android

06.04.2014, 10:46. Просмотров 630. Ответов 2
Метки (Все метки)

Здравствуйте!

Вот мой код:
com_contedevel_tests_SpeedTest.h
C++
1
2
3
4
5
6
7
8
9
10
11
12
13
14
15
16
17
18
19
20
21
/* DO NOT EDIT THIS FILE - it is machine generated */
#include <jni.h>
/* Header for class com_contedevel_tests_SpeedTest */
 
#ifndef _Included_com_contedevel_tests_SpeedTest
#define _Included_com_contedevel_tests_SpeedTest
#ifdef __cplusplus
extern "C" {
#endif
/*
 * Class:     com_contedevel_tests_SpeedTest
 * Method:    getResult
 * Signature: ([F[FII)F
 */
JNIEXPORT jfloat JNICALL Java_com_contedevel_tests_SpeedTest_getResult
  (JNIEnv *, jobject, jfloatArray, jfloatArray, jint, jint);
 
#ifdef __cplusplus
}
#endif
#endif
tests.cpp
C++
1
2
3
4
5
6
7
8
#include "com_contedevel_tests_SpeedTest.h"
 
JNIEXPORT jfloat JNICALL Java_com_contedevel_tests_SpeedTest_getResult
  (JNIEnv * env, jobject obj, jfloatArray m1, jfloatArray m2, jint s1, jint s2) {
    float res = 0;
    
    return res;
}
А вот вывод при сборке:
Кликните здесь для просмотра всего текста
10:37:55 **** Build of configuration Default for project tests ****
/home/contedevel/android-ndk/ndk-build all
Android NDK: WARNING: APP_PLATFORM android-19 is larger than android:minSdkVersion 8 in ./AndroidManifest.xml
[armeabi-v7a] Compile++ thumb: tests <= tests.cpp
jni/tests.cpp: In function 'jfloat Java_com_contedevel_tests_SpeedTest_getResult(JNIEnv*, jobject, jfloatArray, jfloatArray, jint, jint)':
jni/tests.cpp:5:56: error: variable-sized object 'm' may not be initialized
jni/tests.cpp:7:20: error: no match for 'operator*' in '*(m1 + ((unsigned int)i)) * *(m2 + ((unsigned int)i))'
jni/tests.cpp:10:9: error: cannot convert '_jfloatArray**' to 'jfloat {aka float}' in return
make: *** [obj/local/armeabi-v7a/objs/tests/tests.o] Error 1

10:37:55 Build Finished (took 169ms)


Я не понимаю, в чем ошибка... Кто-нибудь может объяснить?
0
Надоела реклама? Зарегистрируйтесь и она исчезнет полностью.
 
КиберФорум - форум программистов, компьютерный форум, программирование
Powered by vBulletin® Version 3.8.9
Copyright ©2000 - 2017, vBulletin Solutions, Inc.
Рейтинг@Mail.ru