Форум программистов, компьютерный форум CyberForum.ru

количество чисел, совпадающих с номером столбца, в которых они находятся - C++

Восстановить пароль Регистрация
Другие темы раздела
C++ Метод Гаусса http://www.cyberforum.ru/cpp-beginners/thread111683.html
Подскажите пожалуйста код в С++ решение слау методом гаусса с выбором главного элемента по строке...
C++ Составить частотный словарь вводимого текста 14. Составить частотный словарь вводимого текста. Распечатать его по алфавиту, а справа от каждого слова – частоту, с которой оно встретилось. http://www.cyberforum.ru/cpp-beginners/thread111682.html
Метод Джордана-Гаусса C++
Всем доброго времени суток))) У меня вот такая проблема, нужно доделать прогу(метод Джордана-Гаусса), то есть нужно сделать так, что бы данные не выводились рандомно на экран, а выводились рандомно в файл, и результат также выводился рандомно в файл, помогите доделать, здесь не много осталось))Вот код программы: #include <iostream> #include <time.h> using namespace std; int n; double...
C++ с++ . минуты
определить полное количество часов и минут, которые прошли от начала суток до того мгновения, когда часовая стрелка обернулась на f градусов. осталось правильно рассчитать минуты. и всё, что я понимаю, это то, что если, например угол равен 40, то 30 - часы(1 час), остаток т.е. 10 - минуты(около 8 мин). а вот как программно изобразить...по крайней мере как на с++ не знаю =( #include...
C++ Cумма http://www.cyberforum.ru/cpp-beginners/thread111613.html
2. Для любого целого К обозначим количество цифр в его десятичной записи D(К). Дано натуральное число n. Вычислить Сумму от i=1 до n,D(k)/factorial(i)
C++ Вектор класс Всем привет!!! Вот написал программу с класами а она не правильно работеает. Пожалуйста помогоите исправить ошыбки. Сама задача:Создать класс vector3D, который задается тройкой координат. Обязательно должны быть реализованы: добавление и вычитание векторов, скалярного умножения векторов, умножение на скаляр, сравнение векторов, вычисление длины вектора, сравнение длин векторов. В задачи должны... подробнее

Показать сообщение отдельно
robert19
25 / 25 / 3
Регистрация: 26.03.2010
Сообщений: 305
01.04.2010, 19:20  [ТС]     количество чисел, совпадающих с номером столбца, в которых они находятся
1>------ Build started: Project: Test, Configuration: Debug Win32 ------
1>Compiling...
1>Test.cpp
1>c:\users\******\documents\visual studio 2008\projects\test\test\test.cpp(6) : warning C4996: 'scanf': This function or variable may be unsafe. Consider using scanf_s instead. To disable deprecation, use _CRT_SECURE_NO_WARNINGS. See online help for details.
1> c:\program files (x86)\microsoft visual studio 9.0\vc\include\stdio.h(306) : see declaration of 'scanf'
1>c:\users\******\documents\visual studio 2008\projects\test\test\test.cpp(8) : warning C4996: 'scanf': This function or variable may be unsafe. Consider using scanf_s instead. To disable deprecation, use _CRT_SECURE_NO_WARNINGS. See online help for details.
1> c:\program files (x86)\microsoft visual studio 9.0\vc\include\stdio.h(306) : see declaration of 'scanf'
1>c:\users\******\documents\visual studio 2008\projects\test\test\test.cpp(12) : error C2082: redefinition of formal parameter 'matr'
1>c:\users\******\documents\visual studio 2008\projects\test\test\test.cpp(15) : warning C4244: 'argument' : conversion from 'time_t' to 'unsigned int', possible loss of data
1>c:\users\******\documents\visual studio 2008\projects\test\test\test.cpp(26) : error C2601: 'schet_str' : local function definitions are illegal
1> c:\users\******\documents\visual studio 2008\projects\test\test\test.cpp(11): this line contains a '{' which has not yet been matched
1>c:\users\******\documents\visual studio 2008\projects\test\test\test.cpp(40) : error C2601: 'schet_stb' : local function definitions are illegal
1> c:\users\******\documents\visual studio 2008\projects\test\test\test.cpp(11): this line contains a '{' which has not yet been matched
1>c:\users\******\documents\visual studio 2008\projects\test\test\test.cpp(49) : error C2601: 'del_matr' : local function definitions are illegal
1> c:\users\******\documents\visual studio 2008\projects\test\test\test.cpp(11): this line contains a '{' which has not yet been matched
1>c:\users\******\documents\visual studio 2008\projects\test\test\test.cpp(56) : error C2601: 'main' : local function definitions are illegal
1> c:\users\******\documents\visual studio 2008\projects\test\test\test.cpp(11): this line contains a '{' which has not yet been matched
1>c:\users\******\documents\visual studio 2008\projects\test\test\test.cpp(69) : fatal error C1075: end of file found before the left brace '{' at 'c:\users\******\documents\visual studio 2008\projects\test\test\test.cpp(11)' was matched
1>Build log was saved at "file://c:\Users\******\Documents\Visual Studio 2008\Projects\Test\Test\Debug\BuildLog.htm"
1>Test - 6 error(s), 3 warning(s)
========== Build: 0 succeeded, 1 failed, 0 up-to-date, 0 skipped ==========

Вот такие вот ошибки. Так как я другой язык учил, так вот и не понимаю
 
Текущее время: 14:13. Часовой пояс GMT +3.
КиберФорум - форум программистов, компьютерный форум, программирование
Powered by vBulletin® Version 3.8.9
Copyright ©2000 - 2016, vBulletin Solutions, Inc.
Рейтинг@Mail.ru