Форум программистов, компьютерный форум CyberForum.ru
Наши страницы

Ошибка у ffmpeg в eclipse - Программирование Android

Войти
Регистрация
Восстановить пароль
Другие темы раздела
Программирование Android Не работает for после else http://www.cyberforum.ru/android-dev/thread1510077.html
Добрый вечер! Не могу найти ошибку почему не работает for после else Не работает на 32 строке //первый if if(_1Sb) { for (int i = 0; i < _1S; i++) ...
Программирование Android Как сделать скриншот экрана без прав Root-а? как сделать скриншот всего экрана без использования(getRootView()) без рут прав ?? http://www.cyberforum.ru/android-dev/thread1510015.html
Программирование Android Наручные часы на Android
Кто-нибудь РЕАЛЬНО этими девайсами пользовался?...
Android смена позиции скроллинга Программирование Android
Всем доброго времени суток! Как можно при программном добавлении view элементов перемещать скроллинг в самый низ?
Программирование Android Navigation Drawer OnClick Событие http://www.cyberforum.ru/android-dev/thread1509895.html
Подскажите плз, как делать онклик событие для драуера... Гугл нашел че то - не сработало...
Программирование Android Определить координаты картинки на канве Добрый день. Вот мой код. public class MainActivity extends Activity { /** Called when the activity is first created. */ @Override public void... подробнее

Показать сообщение отдельно
mercooliy
6 / 6 / 0
Регистрация: 12.05.2013
Сообщений: 145

Ошибка у ffmpeg в eclipse - Программирование Android

05.08.2015, 01:53. Просмотров 204. Ответов 0
Метки (Все метки)

Всем привет, собрал либу для eclipse ffmpeg - но когда пишу на си примерно такой код
C
1
2
3
4
5
jint Java_demo_ffmpeg_MainActivity_logFileInfo(JNIEnv * env, jobject this, jstring filename)
{
    av_register_all();
return 0
}
пишется мне вот такой лог
Android NDK: WARNING: APP_PLATFORM android-15 is larger than android:minSdkVersion 7 in ./AndroidManifest.xml
[armeabi] Compile thumb : test <= test.c
[armeabi] SharedLibrary : libtest.so
jni/ffmpeg/test.c:13: error: undefined reference to 'av_register_all'
collect2.exe: error: ld returned 1 exit status
make.exe: *** [obj/local/armeabi/libtest.so] Error 1

Если убирать av_register_all(); (ну то есть не делать вызов функции какой нить) то компилится норм. В чем проблема может быть?
0
Надоела реклама? Зарегистрируйтесь и она исчезнет полностью.
 
КиберФорум - форум программистов, компьютерный форум, программирование
Powered by vBulletin® Version 3.8.9
Copyright ©2000 - 2017, vBulletin Solutions, Inc.
Рейтинг@Mail.ru