Форум программистов, компьютерный форум CyberForum.ru
Наши страницы

Не могу собрать приложение в android studio 2.1 - Программирование Android

Войти
Регистрация
Восстановить пароль
Другие темы раздела
Программирование Android Java.lang.IllegalAccessError: Class ref in pre-verified class resolved to unexpected implementation http://www.cyberforum.ru/android-dev/thread1793190.html
Здравствуйте. При динамической загрузке кода столкнулся с такой ошибкой: E/AndroidRuntime(27808): Caused by: java.lang.IllegalAccessError: Class ref in pre-verified class resolved to unexpected...
Программирование Android Распарсить int Gravity в String Например имеется: <TextView android:id="@id/expander" android:text="Fewer Details" android:layout_gravity="center_vertical|start" android:layout_width="wrap_content" ... http://www.cyberforum.ru/android-dev/thread1793121.html
Таймер, AlarmManager и Service на Android Программирование Android
Добрый вечер. Я уже создавал тем(ы) про таймер. И мне очень здорово помогли разобраться с Андроидом, особенно OlegJV, powowstal. Собственно, нижеприведенный код отчасти будет состоять из их...
Http POST запрос, как правильно написать Программирование Android
Добрый день, мне нужно отправить данные на сервер, посредством http post запросом, нужно добавить автомобиль, сам пост запрос выглядит вот так:...
Программирование Android Ошибка при использовании action bar sherlock http://www.cyberforum.ru/android-dev/thread1793066.html
Всем привет, недавно достался проект с action bar sherlock, нужно добавить поддержку твиттера, я использовал Fabric plagin для этого, добавил нужные зависимости. Но в проекте используется...
Программирование Android Получить данных о пользователе по gmail (пол, возраст) Добрый день, уважаемые. Я умею считывать адреса почтовых ящиков с телефона. Определяю основной у пользователя по gmail. - и если обрезать название почты можно кое-как вытянуть имя..или ник. Но... подробнее

Показать сообщение отдельно
LIBERALRUS
-39 / 0 / 0
Регистрация: 14.08.2016
Сообщений: 20
14.08.2016, 12:50  [ТС]
Information:76 errors
Error:Execution failed for task ':app:transformClassesWithDexForDebug'.
> com.android.build.api.transform.TransformException: java.lang.RuntimeException: com.android.ide.common.process.ProcessException: java.util.concurrent.ExecutionException: com.android.ide.common.process.ProcessException: org.gradle.process.internal.ExecException: Process 'command 'C:\Program Files\Java\jdk1.7.0_79\bin\java.exe'' finished with non-zero exit value 1
Error:java.lang.UnsupportedClassVersionError: com/android/dx/command/Main : Unsupported major.minor version 52.0
Error: at java.lang.ClassLoader.defineClass(ClassLoader.java:800)
:app:mergeDebugShaders UP-TO-DATE
Error: at java.net.URLClassLoader.access$100(URLClassLoader.java:71)
Error:java.lang.UnsupportedClassVersionError: com/android/dx/command/Main : Unsupported major.minor version 52.0
Error: at java.lang.ClassLoader.defineClass1(Native Method)
It currently has approximately 910 MB.
Error: at java.net.URLClassLoader.defineClass(URLClassLoader.java:449)
Error: at java.net.URLClassLoader$1.run(URLClassLoader.java:361)
Information:See complete output in console
Error: at java.lang.ClassLoader.loadClass(ClassLoader.java:358)
Error: at java.net.URLClassLoader.defineClass(URLClassLoader.java:449)
:appreBuild UP-TO-DATE
:apprepareDebugDependencies
:apprepareComAndroidSupportSupportV42340Library UP-TO-DATE
:appreReleaseBuild UP-TO-DATE
Error: at java.net.URLClassLoader.findClass(URLClassLoader.java:354)
Error: at java.net.URLClassLoader$1.run(URLClassLoader.java:355)
Error: at java.net.URLClassLoader.access$100(URLClassLoader.java:71)
:appreDebugBuild UP-TO-DATE
:app:compileDebugSources UP-TO-DATE
:apprepareComAndroidSupportSupportVectorDrawable2340Library UP-TO-DATE
Error: at java.security.SecureClassLoader.defineClass(SecureClassLoader.java:142)
For more information see https://docs.gradle.org/current/user...vironment.html
:app:checkDebugManifest
Error: at java.lang.ClassLoader.defineClass(ClassLoader.java:800)
Error: at java.net.URLClassLoader$1.run(URLClassLoader.java:361)
Error: at java.security.AccessController.doPrivileged(Native Method)
Error: at java.lang.ClassLoader.defineClass(ClassLoader.java:800)
Error: at java.net.URLClassLoader.access$100(URLClassLoader.java:71)
:apprepareComAndroidSupportAppcompatV72340Library UP-TO-DATE
Error:Exception in thread "main"
Information:BUILD FAILED
Error: at java.net.URLClassLoader$1.run(URLClassLoader.java:361)
Error: at sun.misc.Launcher$AppClassLoader.loadClass(Launcher.java:308)
Error: at java.lang.ClassLoader.defineClass(ClassLoader.java:800)
To run dex in process, the Gradle daemon needs a larger heap.
:app:compileDebugRenderscript UP-TO-DATE
Error:java.lang.UnsupportedClassVersionError: com/android/dx/command/Main : Unsupported major.minor version 52.0
:approcessDebugManifest UP-TO-DATE
Error: at sun.launcher.LauncherHelper.checkAndLoadMain(LauncherHelper.java:482)
Error: at java.lang.ClassLoader.defineClass(ClassLoader.java:800)
Error: at java.security.AccessController.doPrivileged(Native Method)
Error: at java.lang.ClassLoader.defineClass1(Native Method)
Error:Exception in thread "main"
Error: at java.net.URLClassLoader.defineClass(URLClassLoader.java:449)
Error: at java.net.URLClassLoader$1.run(URLClassLoader.java:361)
:apprepareComAndroidSupportAnimatedVectorDrawable2340Library UP-TO-DATE
Information:Total time: 3 mins 45.22 secs
Information:0 warnings
Error: at java.security.SecureClassLoader.defineClass(SecureClassLoader.java:142)
:app:compileDebugJavaWithJavac UP-TO-DATE
Error: at java.lang.ClassLoader.defineClass1(Native Method)
Error: at java.lang.ClassLoader.loadClass(ClassLoader.java:358)
Error:java.lang.UnsupportedClassVersionError: com/android/dx/command/Main : Unsupported major.minor version 52.0
Error:Exception in thread "main"
Error: at java.net.URLClassLoader$1.run(URLClassLoader.java:355)
Error: at java.lang.ClassLoader.loadClass(ClassLoader.java:425)
Error:Exception in thread "main"
Information:Gradle tasks [:app:assembleDebug]
:app:compileDebugAidl UP-TO-DATE
Error: at java.security.SecureClassLoader.defineClass(SecureClassLoader.java:142)
:app:generateDebugAssets UP-TO-DATE
Error: at java.security.SecureClassLoader.defineClass(SecureClassLoader.java:142)
:app:mergeDebugResources UP-TO-DATE
Error: at sun.launcher.LauncherHelper.checkAndLoadMain(LauncherHelper.java:482)
Error: at java.net.URLClassLoader$1.run(URLClassLoader.java:361)
:app:generateDebugResValues UP-TO-DATE
:app:transformClassesWithDexForDebug FAILED
Error: at java.net.URLClassLoader$1.run(URLClassLoader.java:355)
Error: at java.lang.ClassLoader.loadClass(ClassLoader.java:425)
Error: at sun.launcher.LauncherHelper.checkAndLoadMain(LauncherHelper.java:482)
Error: at sun.misc.Launcher$AppClassLoader.loadClass(Launcher.java:308)
Error: at sun.misc.Launcher$AppClassLoader.loadClass(Launcher.java:308)
Error: at sun.launcher.LauncherHelper.checkAndLoadMain(LauncherHelper.java:482)
0
 
КиберФорум - форум программистов, компьютерный форум, программирование
Powered by vBulletin® Version 3.8.9
Copyright ©2000 - 2017, vBulletin Solutions, Inc.
Рейтинг@Mail.ru