Форум программистов, компьютерный форум, киберфорум
Наши страницы
Unity, Unity3D
Войти
Регистрация
Восстановить пароль
 
Рейтинг 4.83/6: Рейтинг темы: голосов - 6, средняя оценка - 4.83
MeeLock
0 / 0 / 0
Регистрация: 17.03.2018
Сообщений: 2
1

Ошибки при компиляции unity

17.03.2018, 19:23. Просмотров 1183. Ответов 4

Делал игру на Unity и дошло дело до компиляции, тут начали появляться ошибки, половину которых я решил, и остались эти, с которыми я уже второй день сижу.

Ошибки при компиляции unity


консоль:
Кликните здесь для просмотра всего текста

CommandInvokationFailure: Gradle build failed.
F:/Programms/SDK/jdk\bin\java.exe -classpath "F:\Programms\Unity\Editor\Data\PlaybackEngines\AndroidPlayer\Tools\gradle\lib\gradle-launcher-4.0.1.jar" org.gradle.launcher.GradleMain "-Dorg.gradle.jvmargs=-Xmx2048m" "assembleRelease"

stderr[

FAILURE: Build failed with an exception.

* What went wrong:
Could not determine java version from '9.0.4'.

* Try:
Run with --stacktrace option to get the stack trace. Run with --info or --debug option to get more log output.
]
stdout[

]
exit code: 1
UnityEditor.Android.Command.WaitForProgramToRun (UnityEditor.Utils.Program p, UnityEditor.Android.WaitingForProcessToExit waitingForProcessToExit, System.String errorMsg)
UnityEditor.Android.Command.Run (System.Diagnostics.ProcessStartInfo psi, UnityEditor.Android.WaitingForProcessToExit waitingForProcessToExit, System.String errorMsg)
UnityEditor.Android.AndroidJavaTools.RunJava (System.String args, System.String workingdir, System.Action`1 progress, System.String error)
UnityEditor.Android.GradleWrapper.Run (System.String workingdir, System.String task, System.Action`1 progress)
Rethrow as GradleInvokationException: Gradle build failed
UnityEditor.Android.GradleWrapper.Run (System.String workingdir, System.String task, System.Action`1 progress)
UnityEditor.Android.PostProcessor.Tasks.BuildGradleProject.Execute (UnityEditor.Android.PostProcessor.PostProcessorContext context)
UnityEditor.Android.PostProcessor.PostProcessRunner.RunAllTasks (UnityEditor.Android.PostProcessor.PostProcessorContext context)
UnityEngine.GUIUtility:ProcessEvent(Int32, IntPtr)

Кликните здесь для просмотра всего текста

Error building Player: 2 errors

Build completed with a result of 'Failed'
UnityEngine.GUIUtility:ProcessEvent(Int32, IntPtr)

UnityEditor.BuildPlayerWindow+BuildMethodException: 3 errors
at UnityEditor.BuildPlayerWindow+DefaultBuildMethods.BuildPlayer (BuildPlayerOptions options) [0x0020e] in C:\buildslave\unity\build\Editor\Mono\BuildPlayerWindowBuildMethods.cs:181
at UnityEditor.BuildPlayerWindow.CallBuildMethods (Boolean askForBuildLocation, BuildOptions defaultBuildOptions) [0x00065] in C:\buildslave\unity\build\Editor\Mono\BuildPlayerWindowBuildMethods.cs:88
UnityEngine.GUIUtility:ProcessEvent(Int32, IntPtr)


Что делать для их решения?
Интернет уже прошерстил, что-то решить не смог, уже отчаялся и на форум.
Прошу более подробно рассказать, что делать. Заранее спасибо.
0
Similar
Эксперт
41792 / 34177 / 6122
Регистрация: 12.04.2006
Сообщений: 57,940
17.03.2018, 19:23
Ответы с готовыми решениями:

При компиляции unity выдает ошибку, связанную с usb
при компиляции unity выдает ошибку связанную с usb

Ошибки при билде проекта в unity
Здравствуйте! На днях мы с другом начали изучать движок юнити,для начала решили просто...

Ошибки при сборке игры после установки unity ads
Я установил рекламу unity ads в игру. В unity реклама работает, но при build игры возникают 3...

Ошибки при компиляции на Android
Здравствуйте! При компиляции на андроид, у меня ошибки: "UnityException: Bundle Identifier has not...

Ошибка компиляции WebGl в Unity
Win32Exception:...

4
ASDFD12
58 / 57 / 15
Регистрация: 15.09.2012
Сообщений: 544
17.03.2018, 19:40 2
ставь джаву 1.8.x.x
1
MeeLock
0 / 0 / 0
Регистрация: 17.03.2018
Сообщений: 2
18.03.2018, 11:28  [ТС] 3
что-то не помогло(
0
UniDigi
0 / 0 / 0
Регистрация: 05.06.2018
Сообщений: 1
05.06.2018, 21:28 4
Если ещё актуально.

И настройках Build Settings смени в поле Build System "Gradle" на "Internal".
0
Миниатюры
Ошибки при компиляции unity  
YoungDevoloper
0 / 0 / 0
Регистрация: 09.04.2018
Сообщений: 11
13.11.2018, 11:30 5
Тут нечего не помогло, на стак оверфлоу тоже.
0
13.11.2018, 11:30
MoreAnswers
Эксперт
37091 / 29110 / 5898
Регистрация: 17.06.2006
Сообщений: 43,301
13.11.2018, 11:30

Как исправить ошибки компиляции?
Какой jdk и sdk поставить я очень много разных конфигураций попробовал, но всегда есть ошибки ...

Где можно почитать основы разработки в Unity/Unity 3D
До этого был небольшой опыт работы с Windows.Forms и WFP с C#. Где можно разобраться и научится...

Ошибка при билде в Unity:
Здравствуйте! Помогите пожалуйста,с решением проблемы! При билде игры на андроид выходит...


Искать еще темы с ответами

Или воспользуйтесь поиском по форуму:
5
Ответ Создать тему
Опции темы

КиберФорум - форум программистов, компьютерный форум, программирование
Powered by vBulletin® Version 3.8.9
Copyright ©2000 - 2019, vBulletin Solutions, Inc.
Рейтинг@Mail.ru