Форум программистов, компьютерный форум, киберфорум
C++: IDE, инструментарий
Войти
Регистрация
Восстановить пароль
 
Рейтинг 4.89/47: Рейтинг темы: голосов - 47, средняя оценка - 4.89
0 / 0 / 0
Регистрация: 15.04.2019
Сообщений: 8
1

Скачал Clion, установил MinGW, пытался настроить, но так и не смог. Clion говорит, что Cmake выдаёт ошибку

26.06.2019, 18:45. Показов 8725. Ответов 1
Метки нет (Все метки)

Скачал Clion, установил MinGW, пытался настроить, но так и не смог. Clion говорит, что Cmake выдаёт ошибку
-- The C compiler identification is GNU 8.1.0
-- The CXX compiler identification is GNU 8.1.0
-- Check for working C compiler: C:/Program Files (x86)/mingw-w64/i686-8.1.0-posix-dwarf-rt_v6-rev0/mingw32/bin/gcc.exe
-- Check for working C compiler: C:/Program Files (x86)/mingw-w64/i686-8.1.0-posix-dwarf-rt_v6-rev0/mingw32/bin/gcc.exe -- broken
CMake Error at C:/Program Files/JetBrains/CLion 2019.1.4/bin/cmake/win/share/cmake-3.14/Modules/CMakeTestCCompiler.cmake:60 (message):
The C compiler

"C:/Program Files (x86)/mingw-w64/i686-8.1.0-posix-dwarf-rt_v6-rev0/mingw32/bin/gcc.exe"

is not able to compile a simple test program.

It fails with the following output:

Change Dir: C:/Users/ЗЫЗник/AppData/Local/Temp/cmake_check_environment1/_build226185938064549912/CMakeFiles/CMakeTmp

Run Build Command(s):C:/PROGRA~2/MINGW-~1/I686-8~1.0-P/mingw32/bin/mingw32-make.exe cmTC_9b312/fast
C:/PROGRA~2/MINGW-~1/I686-8~1.0-P/mingw32/bin/mingw32-make.exe -f CMakeFiles\cmTC_9b312.dir\build.make CMakeFiles/cmTC_9b312.dir/build
mingw32-make.exe[1]: Entering directory 'C:/Users/╟█╟эшъ/AppData/Local/Temp/cmake_check_environment1/_build226185938064549912/CMakeFiles/CMakeTmp'
Building C object CMakeFiles/cmTC_9b312.dir/testCCompiler.c.obj
C:\PROGRA~2\MINGW-~1\I686-8~1.0-P\mingw32\bin\gcc.exe -o CMakeFiles\cmTC_9b312.dir\testCCompiler.c.obj -c C:\Users\в•ЁР§в•ЁР»в•ЁР§в•Ёв•њв•Ёв••в•Ёв•‘\AppData\Local\Tem p\cmake_check_environment1\_build226185938064549912\CMakeFil es\CMakeTmp\testCCompiler.c
gcc.exe: error: C:\Users\в•ЁР§в•ЁР»в•ЁР§в•Ёв•њв•Ёв••в•Ёв•‘\AppData\Local\Tem p\cmake_check_environment1\_build226185938064549912\CMakeFil es\CMakeTmp\testCCompiler.c: No such file or directory
gcc.exe: fatal error: no input files
compilation terminated.
mingw32-make.exe[1]: *** [CMakeFiles\cmTC_9b312.dir\build.make:65: CMakeFiles/cmTC_9b312.dir/testCCompiler.c.obj] Error 1
mingw32-make.exe[1]: Leaving directory 'C:/Users/╟█╟эшъ/AppData/Local/Temp/cmake_check_environment1/_build226185938064549912/CMakeFiles/CMakeTmp'
mingw32-make.exe: *** [Makefile:120: cmTC_9b312/fast] Error 2




CMake will not be able to correctly generate this project.
Call Stack (most recent call first):
CMakeLists.txt:1 (project)


-- Configuring incomplete, errors occurred!
See also "C:/Users/ЗЫЗник/AppData/Local/Temp/cmake_check_environment1/_build226185938064549912/CMakeFiles/CMakeOutput.log".
See also "C:/Users/ЗЫЗник/AppData/Local/Temp/cmake_check_environment1/_build226185938064549912/CMakeFiles/CMakeError.log".

Error code: 1
__________________
Помощь в написании контрольных, курсовых и дипломных работ здесь
0
Programming
Эксперт
94731 / 64177 / 26122
Регистрация: 12.04.2006
Сообщений: 116,782
26.06.2019, 18:45
Ответы с готовыми решениями:

Не могу подключить MinGW в CLion, выдаёт ошибку
Есть предположение что это от русских букв в пути, но я не могу никак поменять это. Пробовал я...

Как OpenSSL добавить в линковку CLion (используется cmake и mingw)
Приветствую, друзья. Как добавить OpenSSL в линковку проекта? Я видел FingOpenSSL (cmake), но...

[CLion] настройка дебагера на Windows 10. Не работает дебаг с профилем Visual Studio или CMake с профилем MinGW
Сделал скриншоты с настройками. Как это дело настроить? На Mac OS поставил, всё работает из...

CMake, CLion, PDCurses
Возникли проблемы с подключением файлов библиотеки PDCurses. CMake находит ее, подключает, но потом...

1
Эксперт С++
8554 / 4130 / 908
Регистрация: 15.11.2014
Сообщений: 9,328
26.06.2019, 20:21 2
Цитата Сообщение от Pedestrian Посмотреть сообщение
gcc.exe: error: C:\Users\в•ЁР§в•ЁР»в•ЁР§в•Ёв•њв•Ёв••в•Ёв•‘\AppData\Local\Tem p\cmake_check_environment1\_build226185938064549912\CMakeFil es\CMakeTmp\testCCompiler.c: No such file or directory
любители русских буковок в файловых путях должны страдать.
1
IT_Exp
Эксперт
87844 / 49110 / 22898
Регистрация: 17.06.2006
Сообщений: 92,604
26.06.2019, 20:21

Boost + Cmake + Clion
Помогите мне подключить Boost к Clion на Windows. Перепробовал уже кучу вариантов - ничего не...

Не линкуется FreeGLUT в CMake (CLion)
Доброго времени суток. Никак не могу прилинковать FreeGLUT в CMake (который в CLion). FreeGLUT...

Clion+MinGW+ SDL
Пожалуйста помогите исправить. Файлы с SDL2 закинул в MinGW Main.cpp #include <iostream>...


Искать еще темы с ответами

Или воспользуйтесь поиском по форуму:
2
Ответ Создать тему
Опции темы

КиберФорум - форум программистов, компьютерный форум, программирование
Powered by vBulletin® Version 3.8.9
Copyright ©2000 - 2021, vBulletin Solutions, Inc.