0 / 0 / 0
Регистрация: 10.03.2019
Сообщений: 314
1

RenPy - Ошибка при сборке APK

18.12.2020, 13:06. Показов 4437. Ответов 0

Author24 — интернет-сервис помощи студентам
Здравствуйте!
Хочу собрать APK в RenPy.
Но при сборке выдаёт ошибку.
Код
Ren'Py 7.3.5.606

�������� ������

������ ���������� ��������

����� ���������� ������

��������� Gradle ��� ������ ������
:app:preBuild UP-TO-DATE
:renpyandroid:preBuild UP-TO-DATE
:renpyandroid:preReleaseBuild UP-TO-DATE
:renpyandroid:checkReleaseManifest UP-TO-DATE
:renpyandroid:processReleaseManifest UP-TO-DATE
:app:preReleaseBuild UP-TO-DATE
:renpyandroid:compileReleaseAidl UP-TO-DATE
:app:compileReleaseAidl UP-TO-DATE
:renpyandroid:packageReleaseRenderscript NO-SOURCE
:app:compileReleaseRenderscript UP-TO-DATE
:app:checkReleaseManifest UP-TO-DATE
:app:generateReleaseBuildConfig UP-TO-DATE
:app:prepareLintJar UP-TO-DATE
:app:mainApkListPersistenceRelease UP-TO-DATE
:app:generateReleaseResValues UP-TO-DATE
:app:generateReleaseResources UP-TO-DATE
:renpyandroid:compileReleaseRenderscript UP-TO-DATE
:renpyandroid:generateReleaseResValues UP-TO-DATE
:renpyandroid:generateReleaseResources UP-TO-DATE
:renpyandroid:packageReleaseResources UP-TO-DATE
:app:mergeReleaseResources
:app:createReleaseCompatibleScreenManifests UP-TO-DATE
:app:processReleaseManifest UP-TO-DATE
:app:splitsDiscoveryTaskRelease UP-TO-DATE
:renpyandroid:platformAttrExtractor UP-TO-DATE
:renpyandroid:generateReleaseRFile UP-TO-DATE
:app:processReleaseResources
:app:generateReleaseSources
:renpyandroid:generateReleaseBuildConfig UP-TO-DATE
:renpyandroid:prepareLintJar UP-TO-DATE
:renpyandroid:generateReleaseSources UP-TO-DATE
:renpyandroid:javaPreCompileRelease UP-TO-DATE
:renpyandroid:compileReleaseJavaWithJavac UP-TO-DATE
:renpyandroid:processReleaseJavaRes NO-SOURCE
:renpyandroid:transformClassesAndResourcesWithPrepareIntermediateJarsForRelease UP-TO-DATE
:app:javaPreCompileRelease UP-TO-DATE
:app:compileReleaseJavaWithJavac UP-TO-DATE
:app:compileReleaseNdk NO-SOURCE
:app:compileReleaseSources UP-TO-DATE
:app:lintVitalRelease
:app:mergeReleaseShaders UP-TO-DATE
:app:compileReleaseShaders UP-TO-DATE
:app:generateReleaseAssets UP-TO-DATE
:renpyandroid:mergeReleaseShaders UP-TO-DATE
:renpyandroid:compileReleaseShaders UP-TO-DATE
:renpyandroid:generateReleaseAssets UP-TO-DATE
:renpyandroid:packageReleaseAssets UP-TO-DATE
:app:mergeReleaseAssets
:app:transformClassesWithDexBuilderForRelease UP-TO-DATE
:app:transformDexArchiveWithExternalLibsDexMergerForRelease UP-TO-DATE
:app:transformDexArchiveWithDexMergerForRelease UP-TO-DATE
:app:mergeReleaseJniLibFolders UP-TO-DATE
:renpyandroid:compileReleaseNdk NO-SOURCE
:renpyandroid:mergeReleaseJniLibFolders UP-TO-DATE
:renpyandroid:transformNativeLibsWithMergeJniLibsForRelease UP-TO-DATE
:renpyandroid:transformNativeLibsWithIntermediateJniLibsForRelease UP-TO-DATE
:app:transformNativeLibsWithMergeJniLibsForRelease UP-TO-DATE
:app:processReleaseJavaRes NO-SOURCE
:app:transformResourcesWithMergeJavaResForRelease UP-TO-DATE
:app:validateSigningRelease UP-TO-DATE
:app:packageRelease FAILED

FAILURE: Build failed with an exception.

* What went wrong:
Execution failed for task ':app:packageRelease'.
> Java heap space

* Try:
Run with --info or --debug option to get more log output. Run with --scan to get full insights.

* Exception is:
org.gradle.api.tasks.TaskExecutionException: Execution failed for task ':app:packageRelease'.
	at org.gradle.api.internal.tasks.execution.ExecuteActionsTaskExecuter.executeActions(ExecuteActionsTaskExecuter.java:100)
	at org.gradle.api.internal.tasks.execution.ExecuteActionsTaskExecuter.execute(ExecuteActionsTaskExecuter.java:70)
	at org.gradle.api.internal.tasks.execution.OutputDirectoryCreatingTaskExecuter.execute(OutputDirectoryCreatingTaskExecuter.java:51)
	at org.gradle.api.internal.tasks.execution.SkipUpToDateTaskExecuter.execute(SkipUpToDateTaskExecuter.java:62)
	at org.gradle.api.internal.tasks.execution.ResolveTaskOutputCachingStateExecuter.execute(ResolveTaskOutputCachingStateExecuter.java:54)
	at org.gradle.api.internal.tasks.execution.ValidatingTaskExecuter.execute(ValidatingTaskExecuter.java:60)
	at org.gradle.api.internal.tasks.execution.SkipEmptySourceFilesTaskExecuter.execute(SkipEmptySourceFilesTaskExecuter.java:97)
	at org.gradle.api.internal.tasks.execution.CleanupStaleOutputsExecuter.execute(CleanupStaleOutputsExecuter.java:87)
	at org.gradle.api.internal.tasks.execution.ResolveTaskArtifactStateTaskExecuter.execute(ResolveTaskArtifactStateTaskExecuter.java:52)
	at org.gradle.api.internal.tasks.execution.SkipTaskWithNoActionsExecuter.execute(SkipTaskWithNoActionsExecuter.java:52)
	at org.gradle.api.internal.tasks.execution.SkipOnlyIfTaskExecuter.execute(SkipOnlyIfTaskExecuter.java:54)
	at org.gradle.api.internal.tasks.execution.ExecuteAtMostOnceTaskExecuter.execute(ExecuteAtMostOnceTaskExecuter.java:43)
	at org.gradle.api.internal.tasks.execution.CatchExceptionTaskExecuter.execute(CatchExceptionTaskExecuter.java:34)
	at org.gradle.execution.taskgraph.DefaultTaskGraphExecuter$EventFiringTaskWorker$1.run(DefaultTaskGraphExecuter.java:248)
	at org.gradle.internal.progress.DefaultBuildOperationExecutor$RunnableBuildOperationWorker.execute(DefaultBuildOperationExecutor.java:336)
	at org.gradle.internal.progress.DefaultBuildOperationExecutor$RunnableBuildOperationWorker.execute(DefaultBuildOperationExecutor.java:328)
	at org.gradle.internal.progress.DefaultBuildOperationExecutor.execute(DefaultBuildOperationExecutor.java:199)
	at org.gradle.internal.progress.DefaultBuildOperationExecutor.run(DefaultBuildOperationExecutor.java:110)
	at org.gradle.execution.taskgraph.DefaultTaskGraphExecuter$EventFiringTaskWorker.execute(DefaultTaskGraphExecuter.java:241)
	at org.gradle.execution.taskgraph.DefaultTaskGraphExecuter$EventFiringTaskWorker.execute(DefaultTaskGraphExecuter.java:230)
	at org.gradle.execution.taskgraph.DefaultTaskPlanExecutor$TaskExecutorWorker.processTask(DefaultTaskPlanExecutor.java:123)
	at org.gradle.execution.taskgraph.DefaultTaskPlanExecutor$TaskExecutorWorker.access$200(DefaultTaskPlanExecutor.java:79)
	at org.gradle.execution.taskgraph.DefaultTaskPlanExecutor$TaskExecutorWorker$1.execute(DefaultTaskPlanExecutor.java:104)
	at org.gradle.execution.taskgraph.DefaultTaskPlanExecutor$TaskExecutorWorker$1.execute(DefaultTaskPlanExecutor.java:98)
	at org.gradle.execution.taskgraph.DefaultTaskExecutionPlan.execute(DefaultTaskExecutionPlan.java:626)
	at org.gradle.execution.taskgraph.DefaultTaskExecutionPlan.executeWithTask(DefaultTaskExecutionPlan.java:581)
	at org.gradle.execution.taskgraph.DefaultTaskPlanExecutor$TaskExecutorWorker.run(DefaultTaskPlanExecutor.java:98)
	at org.gradle.internal.concurrent.ExecutorPolicy$CatchAndRecordFailures.onExecute(ExecutorPolicy.java:63)
	at org.gradle.internal.concurrent.ManagedExecutorImpl$1.run(ManagedExecutorImpl.java:46)
	at org.gradle.internal.concurrent.ThreadFactoryImpl$ManagedThreadRunnable.run(ThreadFactoryImpl.java:55)
Caused by: org.gradle.tooling.BuildException: Java heap space
	at com.android.build.gradle.internal.scope.BuildElements$ExecutorBasedScheduler$transform$2.invoke(BuildElements.kt:133)
	at com.android.build.gradle.internal.scope.BuildElements$ExecutorBasedScheduler$transform$2.invoke(BuildElements.kt:110)
	at kotlin.sequences.SequencesKt___SequencesKt$onEach$1.invoke(_Sequences.kt:1260)
	at kotlin.sequences.TransformingSequence$iterator$1.next(Sequences.kt:148)
	at kotlin.sequences.FilteringSequence$iterator$1.calcNext(Sequences.kt:108)
	at kotlin.sequences.FilteringSequence$iterator$1.hasNext(Sequences.kt:132)
	at kotlin.sequences.TransformingSequence$iterator$1.hasNext(Sequences.kt:152)
	at kotlin.sequences.SequencesKt___SequencesKt.toCollection(_Sequences.kt:633)
	at kotlin.sequences.SequencesKt___SequencesKt.toMutableList(_Sequences.kt:663)
	at kotlin.sequences.SequencesKt___SequencesKt.toList(_Sequences.kt:654)
	at com.android.build.gradle.internal.scope.BuildElements$ExecutorBasedScheduler.transform(BuildElements.kt:140)
	at com.android.build.gradle.internal.scope.BuildElements$ExecutorBasedScheduler.into(BuildElements.kt:115)
	at com.android.build.gradle.internal.scope.BuildElementActionScheduler.into(BuildElementActionScheduler.kt:32)
	at com.android.build.gradle.tasks.PackageAndroidArtifact.doFullTaskAction(PackageAndroidArtifact.java:393)
	at com.android.build.gradle.internal.tasks.IncrementalTask.taskAction(IncrementalTask.java:106)
	at org.gradle.internal.reflect.JavaMethod.invoke(JavaMethod.java:73)
	at org.gradle.api.internal.project.taskfactory.IncrementalTaskAction.doExecute(IncrementalTaskAction.java:46)
	at org.gradle.api.internal.project.taskfactory.StandardTaskAction.execute(StandardTaskAction.java:39)
	at org.gradle.api.internal.project.taskfactory.StandardTaskAction.execute(StandardTaskAction.java:26)
	at org.gradle.api.internal.tasks.execution.ExecuteActionsTaskExecuter$1.run(ExecuteActionsTaskExecuter.java:121)
	at org.gradle.internal.progress.DefaultBuildOperationExecutor$RunnableBuildOperationWorker.execute(DefaultBuildOperationExecutor.java:336)
	at org.gradle.internal.progress.DefaultBuildOperationExecutor$RunnableBuildOperationWorker.execute(DefaultBuildOperationExecutor.java:328)
	at org.gradle.internal.progress.DefaultBuildOperationExecutor.execute(DefaultBuildOperationExecutor.java:199)
	at org.gradle.internal.progress.DefaultBuildOperationExecutor.run(DefaultBuildOperationExecutor.java:110)
	at org.gradle.api.internal.tasks.execution.ExecuteActionsTaskExecuter.executeAction(ExecuteActionsTaskExecuter.java:110)
	at org.gradle.api.internal.tasks.execution.ExecuteActionsTaskExecuter.executeActions(ExecuteActionsTaskExecuter.java:92)
	... 29 more
Caused by: java.lang.OutOfMemoryError: Java heap space


* Get more help at https://help.gradle.org

BUILD FAILED in 49s
46 actionable tasks: 5 executed, 41 up-to-date


������, ������ �����������.
Как я понял ошибка в
Код
Execution failed for task ':app:packageRelease'.
.
Как можно решить проблему?
0
Programming
Эксперт
94731 / 64177 / 26122
Регистрация: 12.04.2006
Сообщений: 116,782
18.12.2020, 13:06
Ответы с готовыми решениями:

Ошибка при сборке apk приложения
При сборке приложения на adroid вылазит вот такая ошибка. Вижу, что связано с keystore, пытался...

Ошибки при сборке apk
Единственный скрипт: using System.Collections; using System.Collections.Generic; using...

Ошибка при создании apk
Когда я пытаюсь создать APK файл игры, появляется данная ошибка

Ошибка NoClassDefFoundError при сборке APK
Я уже за*рахался!!! Что делать? Unity, при сборке APK CommandInvokationFailure: Failed to build...

0
18.12.2020, 13:06
IT_Exp
Эксперт
87844 / 49110 / 22898
Регистрация: 17.06.2006
Сообщений: 92,604
18.12.2020, 13:06
Помогаю со студенческими работами здесь

Cкачать .apk для андроид при блокировке скачивания файлов c apk
modem 3g. dinamic. local ip. как можно скачать его, ведь во время посылания его через защищённое...

ошибка при компиляции apk
пробую декомпилировать apk с помощью APKmanager. И если сразу же скомпилировать, то выдаёт ошибку....

Ошибка при компиляции APK
Здравствуйте. Все было нормально, но теперь появляется ошибка, не могу понять, что нужно сделать,...

Ошибка при компиляции в APK
При компиляции игры выдает 3 ошибки нету никаких соображений по поводу них. Screen :...

Почему при добавлении модуля pybluez у меня высвечивается ошибка при компиляции кода в формат apk?
Доброго времени суток!Недавно начал заниматься компиляцией кодов python в формат apk,но столкнулся...

Ошибка при создании файла .apk
Здравствуйте. Не получается разобраться с ошибкой при компиляции файла .apk. Появляется следующая...


Искать еще темы с ответами

Или воспользуйтесь поиском по форуму:
1
Ответ Создать тему
Опции темы

КиберФорум - форум программистов, компьютерный форум, программирование
Powered by vBulletin
Copyright ©2000 - 2024, CyberForum.ru