Форум программистов, компьютерный форум, киберфорум
Софт (программы)
Войти
Регистрация
Восстановить пароль
 
0 / 0 / 0
Регистрация: 28.10.2019
Сообщений: 1
1

Ошибка при установке Gromacs

28.10.2019, 20:15. Просмотров 850. Ответов 0

Устанавливаю Gromacs по инструкции:
tar xfz gromacs-5.0.7.tar.gz
cd gromacs-5.0.7
mkdir build
cd build
cmake .. -DGMX_BUILD_OWN_FFTW=ON -DREGRESSIONTEST_DOWNLOAD=ON
make check
sudo make install
source /usr/local/gromacs/bin/GMXRC

Выдает ошибку после пункта: make check
Scanning dependencies of target mdrun_objlib
CMake Error: Cannot open file for write: /home/sasha/Downloads/gromacs-5.1.1/build/src/programs/CMakeFiles/mdrun_objlib.dir/depend.make.tmp
CMake Error: : System Error: Permission denied
src/programs/CMakeFiles/mdrun_objlib.dir/build.make:233: recipe for target 'src/programs/CMakeFiles/mdrun_objlib.dir/depend' failed
make[3]: *** [src/programs/CMakeFiles/mdrun_objlib.dir/depend] Error 2
CMakeFiles/Makefile2:3042: recipe for target 'src/programs/CMakeFiles/mdrun_objlib.dir/all' failed
make[2]: *** [src/programs/CMakeFiles/mdrun_objlib.dir/all] Error 2
CMakeFiles/Makefile2:780: recipe for target 'CMakeFiles/check.dir/rule' failed
make[1]: *** [CMakeFiles/check.dir/rule] Error 2
Makefile:483: recipe for target 'check' failed
make: *** [check] Error 2

Подскажите что делать?
0
Programming
Эксперт
94731 / 64177 / 26122
Регистрация: 12.04.2006
Сообщений: 116,782
28.10.2019, 20:15
Ответы с готовыми решениями:

При установке Windows XP ошибка error loading operation system а при установке Windows 7 код ошибки 0x0000007b
Доброго времени суток.Принесли со словами переустанови - полез и вот уже 3 день идет дело в том что...

ошибка адобе реадер при установке ошибка 1395 вроде
черт знает что никак не пойму с чего он выкидывает такую ошибку????

Ошибка при установке, ошибка 0xC1900101-0x30018
Здравствуйте,а у меня такая проблема. При установке компонентов ошибка 0xC1900101-0x30018 ошибка...

Ошибка при установке BlueStacks ошибка установки: -1
При попытке установить BlueStacks выдает ошибку

0
IT_Exp
Эксперт
87844 / 49110 / 22898
Регистрация: 17.06.2006
Сообщений: 92,604
28.10.2019, 20:15

Заказываю контрольные, курсовые, дипломные и любые другие студенческие работы здесь.

При установке Windows 7 при начале установки ошибка чтения 0х80070017
Подскажите пожалуйста,при установке 7 на экране в самом начале установки пишется ошибка чтения,и...

Как скомпилировать исходник Gromacs на Windows
Приветствую участников форума! :) Я здесь новичек, поэтому прошу строго не судить. Суть моей...

Ошибка при перезагрузке при установке Windows XP
Здравствуйте, второй день бьюсь с установкой win xp. Вот мои последние действия: с диска...

При установке Corel Draw на виндовс 8 (в домене) при установке пишет отсуствует компонент Net.framework
Здравствуйте. При установке Corel Draw на виндовс 8 при установке пишет отсуствует компонент...


Искать еще темы с ответами

Или воспользуйтесь поиском по форуму:
1
Ответ Создать тему
Опции темы

КиберФорум - форум программистов, компьютерный форум, программирование
Powered by vBulletin® Version 3.8.9
Copyright ©2000 - 2021, vBulletin Solutions, Inc.