0 / 0 / 0
Регистрация: 18.01.2014
Сообщений: 31
1

Error: 'printf' was not declared in this scope

06.12.2015, 17:03. Показов 10843. Ответов 3
Метки нет (Все метки)

Author24 — интернет-сервис помощи студентам
Не могу скомпилировать код.
C++
1
2
3
4
5
6
7
8
9
10
11
12
13
14
15
16
17
18
19
20
21
22
23
24
25
26
27
28
29
30
31
32
33
34
35
36
37
38
39
40
41
42
43
44
45
46
47
48
49
50
51
52
53
54
55
56
57
58
59
60
61
62
63
64
65
66
67
68
69
70
71
72
73
74
75
76
77
78
79
80
81
82
83
84
85
86
87
88
89
90
#include <iostream>
#include <math.h>
#include <locale.h>
using namespace std;
const float p = 3.141592653;
 
float ingdv(float a, float b, float e, float (*f)(float,float,int));
float f1(float a, float b, int n);
float f2(float a, float b, int n);
float f3(float a, float b, int n);
 
int main()
{
    setlocale(LC_CTYPE,"Russian");
    float a,b,rez,e;
    printf("Введите A, B и точность вычисления\n");
    scanf("%f%f%f", &a,&b,&e);
    printf("\nРешение интеграла 3-мя методами:\n\n");
    rez = ingdv(a,p/b,e,f1);
    printf("Метод Трацеция %f\n",rez);
    rez = ingdv(a,p/b,e,f2);
    printf("Метод Прямоугольник %f\n",rez);
    rez = ingdv(a,p/b,e,f3);
    printf("Метод Симпсона %f\n\n",rez);
    return 0;
}
/*-----------------Метод трапеции-------------------*/
float f1(float a, float b, int n)
{
    float h,sum,x;
    int i;
    sum = 0;
    h=(b-a)/n;
    sum += sqrt(tan(a));
    for(i = 1; i < n; i++)
    {
        x = a + i*h;
        sum += 2*sqrt(tan(x));
    }
    x = a + n*h;
    sum += sqrt(tan(x));
    return(0.5*h*sum);
}
/*---------------Метод прямоугольника------------------*/
float f2(float a, float b, int n)
{
    float h,sum,x;
    int i;
    sum = 0;
    h=(b-a)/n;
    for(i = 1; i <= n; i++)
    {
        x = a + (i-0.5)*h;
        sum += sqrt(tan(x));
    }
    return h*sum;
}
/*----------------Метод Симпсона--------------------*/
float f3(float a, float b, int n)
{
    float h, sum,x;
    int i, k;
    sum = 0;
    h=(b-a)/n;
    sum += sqrt(tan(a));
    for(i = 1; i < n; i++)
    {
        x = a + i*h;
        if(i%2 == 0) {k = 2;}
        else {k = 4;}
        sum += k*sqrt(tan(x));
    }
    x = a + n*h;
    sum += sqrt(tan(x));
    return 0.333*h*sum;
}
/*-----------Общая функция-----------*/
float ingdv(float a, float b, float e, float (*f)(float,float,int))
{
    int n = 10;
    float p,k;
    k = f(a,b,n);
    do{
        p = k;
        k = f(a,b,2*n);
        n = n*2;
 
    }while(abs(p-k)<e);
    return k;
}
Лог компилятора:
C:/Program Files/CodeLite/CodeLite/integral/main.cpp: In function 'int main()':
C:/Program Files/CodeLite/CodeLite/integral/main.cpp:16: error: 'printf' was not declared in this scope
C:/Program Files/CodeLite/CodeLite/integral/main.cpp:17: error: 'scanf' was not declared in this scope
C:/Program Files/CodeLite/CodeLite/integral/main.cpp: In function 'float ingdv(float, float, float, float (*)(float, float, int))':
C:/Program Files/CodeLite/CodeLite/integral/main.cpp:88: error: 'abs' was not declared in this scope
mingw32-make.exe[1]: *** [Debug/main.o] Error 1
mingw32-make.exe[1]: Leaving directory `C:/Program Files/CodeLite/CodeLite/integral'
mingw32-make.exe: *** [All] Error 2
----------Build Ended----------
3 errors, 0 warnings
Помогите пожалуйста.
0
Programming
Эксперт
94731 / 64177 / 26122
Регистрация: 12.04.2006
Сообщений: 116,782
06.12.2015, 17:03
Ответы с готовыми решениями:

'arr' was not declared in this scope 'sum' was not declared in this scope такие вот ошибки.(
#include &lt;iostream&gt; #include &lt;cstdlib&gt; #include &lt;ctime&gt; using namespace std; int main () { ...

[Error] 'If' was not declared in this scope
Недавно начал изучать Си++. Написал программу почти так же, как в примере из книги. #include...

error: . was not declared in this scope
Здравстуйте! Недавно начал изучать С++. Нужно написать программу вычисления периметра треугольника...

[Error] 'k' was not declared in this scope
#include &lt;iostream&gt; using namespace std; int main() { { int k; char z = { ...

3
Dimension
594 / 462 / 223
Регистрация: 08.04.2014
Сообщений: 1,710
06.12.2015, 17:05 2
C++
1
#include <stdio.h>
0
0 / 0 / 0
Регистрация: 18.01.2014
Сообщений: 31
06.12.2015, 17:07  [ТС] 3
Спасибо, но еще осталось:
error: 'abs' was not declared in this scope
0
Evg
Эксперт CАвтор FAQ
21279 / 8301 / 637
Регистрация: 30.03.2009
Сообщений: 22,659
Записей в блоге: 30
06.12.2015, 18:12 4
Цитата Сообщение от sketsh Посмотреть сообщение
Спасибо, но еще осталось
Вбей в гугл "man printf" или "man abs", там русским языком написано, какие инклюды подключать надо
1
06.12.2015, 18:12
IT_Exp
Эксперт
87844 / 49110 / 22898
Регистрация: 17.06.2006
Сообщений: 92,604
06.12.2015, 18:12
Помогаю со студенческими работами здесь

[Error] 'm' was not declared in this scope
почему программа не видит m,h??? пишет ошибку 'm' was not declared in this scope 'h' was not...

Hello World не компилируется - ‘PRINTF’ was not declared in this scope
Здравствуйте! Я - абсолютный новичок в программировании на C. Нашёл учебник Кернигана и Ричи....

Error 'setprecision' was not declared in this scope
Глупый скела снова здесь! И так, что я опять сделал не так?)) Ошибка : error 'setprecision' was...

[Error] 'rand' was not declared in this scope
Использую только стандартную библиотеку и тем ни менее выходит ошибка: 'rand' was not declared in...

Ошибка: [Error] 'x' was not declared in this scope
Не могу понять в чём ошибка. Компилятор пишет что в строке cin&gt;&gt;x.name&gt;&gt;x.surname&gt;&gt;x.number; ....

Error: 'setlocate' was not declared in this scope
Нужно написать программу на СИ, я новичок, выдает мне ошибки, что здесь не верно? #include...


Искать еще темы с ответами

Или воспользуйтесь поиском по форуму:
4
Ответ Создать тему
Опции темы

КиберФорум - форум программистов, компьютерный форум, программирование
Powered by vBulletin
Copyright ©2000 - 2024, CyberForum.ru