Форум программистов, компьютерный форум, киберфорум
C++: IDE, инструментарий
Войти
Регистрация
Восстановить пароль
 
Рейтинг 4.50/6: Рейтинг темы: голосов - 6, средняя оценка - 4.50
0 / 0 / 0
Регистрация: 20.03.2020
Сообщений: 8
1

Не могу подключить MinGW в CLion, выдаёт ошибку

21.03.2020, 12:43. Показов 1189. Ответов 2
Метки нет (Все метки)

Есть предположение что это от русских букв в пути, но я не могу никак поменять это. Пробовал я ставить разные версии MinGW, и это не помогло. Смотрел много видео, но ничего не помогло.









The C compiler identification is GNU 7.1.0
-- The CXX compiler identification is GNU 7.1.0
-- Check for working C compiler: C:/Users/PC/mingw-w64/x86_64-7.1.0-posix-seh-rt_v5-rev0/mingw64/bin/gcc.exe
-- Check for working C compiler: C:/Users/PC/mingw-w64/x86_64-7.1.0-posix-seh-rt_v5-rev0/mingw64/bin/gcc.exe -- broken
CMake Error at C:/Users/PC/CLion 2019.3.5/bin/cmake/win/share/cmake-3.15/Modules/CMakeTestCCompiler.cmake:60 (message):
The C compiler

"C:/Users/PC/mingw-w64/x86_64-7.1.0-posix-seh-rt_v5-rev0/mingw64/bin/gcc.exe"

is not able to compile a simple test program.

It fails with the following output:

Change Dir: C:/Users/РџРљ/AppData/Local/Temp/cmake_check_environment/_build5736699875154635816/CMakeFiles/CMakeTmp

Run Build Command(s):C:/Users/PC/mingw-w64/x86_64-7.1.0-posix-seh-rt_v5-rev0/mingw64/bin/mingw32-make.exe cmTC_4bbd7/fast && C:/Users/PC/mingw-w64/x86_64-7.1.0-posix-seh-rt_v5-rev0/mingw64/bin/mingw32-make.exe -f CMakeFiles\cmTC_4bbd7.dir\build.make CMakeFiles/cmTC_4bbd7.dir/build
mingw32-make.exe[1]: Entering directory 'C:/Users/╧╩/AppData/Local/Temp/cmake_check_environment/_build5736699875154635816/CMakeFiles/CMakeTmp'
Building C object CMakeFiles/cmTC_4bbd7.dir/testCCompiler.c.obj
C:\Users\PC\mingw-w64\x86_64-7.1.0-posix-seh-rt_v5-rev0\mingw64\bin\gcc.exe -o CMakeFiles\cmTC_4bbd7.dir\testCCompiler.c.obj -c C:\Users\в•ЁРЇв•ЁРЄ\AppData\Local\Temp\cmake_check_environme nt\_build5736699875154635816\CMakeFiles\CMakeTmp\testCCompil er.c
gcc.exe: error: C:\Users\в•ЁРЇв•ЁРЄ\AppData\Local\Temp\cmake_check_environme nt\_build5736699875154635816\CMakeFiles\CMakeTmp\testCCompil er.c: No such file or directory
gcc.exe: fatal error: no input files
compilation terminated.
CMakeFiles\cmTC_4bbd7.dir\build.make:64: recipe for target 'CMakeFiles/cmTC_4bbd7.dir/testCCompiler.c.obj' failed
mingw32-make.exe[1]: *** [CMakeFiles/cmTC_4bbd7.dir/testCCompiler.c.obj] Error 1
mingw32-make.exe[1]: Leaving directory 'C:/Users/╧╩/AppData/Local/Temp/cmake_check_environment/_build5736699875154635816/CMakeFiles/CMakeTmp'
Makefile:120: recipe for target 'cmTC_4bbd7/fast' failed
mingw32-make.exe: *** [cmTC_4bbd7/fast] Error 2





CMake will not be able to correctly generate this project.
Call Stack (most recent call first):
CMakeLists.txt:1 (project)


-- Configuring incomplete, errors occurred!
See also "C:/Users/РџРљ/AppData/Local/Temp/cmake_check_environment/_build5736699875154635816/CMakeFiles/CMakeOutput.log".
See also "C:/Users/РџРљ/AppData/Local/Temp/cmake_check_environment/_build5736699875154635816/CMakeFiles/CMakeError.log".

Error code: 1
Миниатюры
Не могу подключить MinGW в CLion, выдаёт ошибку  
__________________
Помощь в написании контрольных, курсовых и дипломных работ здесь
0
Programming
Эксперт
94731 / 64177 / 26122
Регистрация: 12.04.2006
Сообщений: 116,782
21.03.2020, 12:43
Ответы с готовыми решениями:

Скачал Clion, установил MinGW, пытался настроить, но так и не смог. Clion говорит, что Cmake выдаёт ошибку
Скачал Clion, установил MinGW, пытался настроить, но так и не смог. Clion говорит, что Cmake выдаёт...

Clion+MinGW+ SDL
Пожалуйста помогите исправить. Файлы с SDL2 закинул в MinGW Main.cpp #include <iostream>...

Как OpenSSL добавить в линковку CLion (используется cmake и mingw)
Приветствую, друзья. Как добавить OpenSSL в линковку проекта? Я видел FingOpenSSL (cmake), но...

MinGW после обновления выдает ошибку "отсутствует libgcc_s_dw2-1.dll"
Здравствуйте! В данный момент я изучаю язык C++ и прохожу различные курсы, которые подразумевают...

2
Нарушитель
3063 / 1670 / 578
Регистрация: 23.09.2014
Сообщений: 5,199
25.03.2020, 21:51 2
Ed Koshman,
попробовал энтот ваш слион:
жуткая хрень.

нужно иметь чистый девственный моск, чтобы поймать фан от этой среды.
0
Нарушитель
3063 / 1670 / 578
Регистрация: 23.09.2014
Сообщений: 5,199
25.03.2020, 21:57 3
Скачал и установил свежий CMake.
Заюзал вот этот https://nuwen.net/mingw.html
Настройки:
Не могу подключить MinGW в CLion, выдаёт ошибку

Хелловолд скомпилился:
Не могу подключить MinGW в CLion, выдаёт ошибку
0
IT_Exp
Эксперт
87844 / 49110 / 22898
Регистрация: 17.06.2006
Сообщений: 92,604
25.03.2020, 21:57

Не могу найти ошибку. Нажимаю на клавишу, выдает ошибку
uses ABCObjects,GraphABC; const Image_0 = '0_765e9_6a3e424a_S.png'; var...

Структура: Не могу понять, почему выдает ошибку и как собственно эту ошибку можно исправить?
Привет,не могу понять почему ошибку выдает и как сбстно эту ошибку можно исправить? #include...

Второй день не могу подключить, выдает ошибки
Здравствуйте! Подскажите как подключить базу MySQL к Datagridview Нашел несколько инструкций,...

Выдает ошибку несоответвствия типа при попытке подключить написаный мною модуль
Прогу запускаю в Pascal School Pack(в нем нет встроенной функции повер лол) Вот модуль: unit...


Искать еще темы с ответами

Или воспользуйтесь поиском по форуму:
3
Ответ Создать тему
Опции темы

КиберФорум - форум программистов, компьютерный форум, программирование
Powered by vBulletin® Version 3.8.9
Copyright ©2000 - 2021, vBulletin Solutions, Inc.